{"text_format":"1","workbook":"xlsx","n_sheets":7,"sheets":["Control Entry","Control Sheet","Riders","Web Page (km)","Route Sheets (prt)","Web results","Sheet1"],"not_rendered":{"charts":0,"images":1,"macros":0,"external_links":0,"defined_names":228,"comments":3,"pivot_tables":0},"unopened":[],"bounds":{"document_bytes":16777216,"sheet_cells":100000,"rows_first":2000,"rows_last":500,"rows_between":2000,"halvings":0,"cell_chars":16384,"cell_head_chars":4096},"cells_cut":0,"cells_raw":0,"read":"whole","date_system":"1900"}

{"sheet":"Control Entry","index":0,"n_rows":29,"n_cols":12,"rows_kept":29,"cut":false,"hidden":false,"merged":[]}
["Brevet Length:",1000,{"$f":"IF(Brevet_Length>=1200,Brevet_Length,IF(Brevet_Length>=1000,1000,IF(Brevet_Length>=600,600,IF(Brevet_Length>=400,400,IF(Brevet_Length>=300,300,IF(Brevet_Length>=200,200,100))))))","v":1000},null,"VI Eureka "]
["Maximum Time:",{"$f":"IF(brevet>=1200,90,IF(brevet>=1000,75,IF(brevet>=600,40,IF(brevet>=400,27,IF(brevet>=300,20,IF(brevet>=200,13.5,IF(brevet>=100,7,0)))))))","v":75}]
["Brevet Description:","Victoria - Gold River - Port Alberni - Cowichan Lake - Sidney - Victoria"]
["Brevet Number:","VI1000B"]
["Start Date:","2014-06-14"]
["Start Time:","03:00:00"]
[null,null,null,"Control"]
[]
[null,null,null,"Distance","Locale","Establishment 1","Establishment 2","Establishment 3","Open","Close","Open time","Close time"]
[null,null,"Control 1",0,"VICTORIA","Tim Horton's","3501 Ravine Way @","Blanshard",{"$f":"Start_date+Start_time","v":"2014-06-14T03:00:00"},{"$f":"I10+\"1:00\"","v":"2014-06-14T04:00:00"},{"$f":"IF(ISBLANK(Distance),\"\",Open Control_1)","v":"2014-06-14T03:00:00"},{"$f":"IF(ISBLANK(Distance),\"\",Close Control_1)","v":"2014-06-14T04:00:00"}]
[null,null,"Control 2",87.2,"CHEMAINUS","SUBWAY on right ","or your choice","opens at what time?",{"$f":"IF(ISBLANK(Distance),\"\",IF(Distance>1000,(Distance-1000)/26+33.0847,(IF(Distance>600,(Distance-600)/28+18.799,(IF(Distance>400,(Distance-400)/30+12.1324,(IF(Distance>200,(Distance-200)/32+5.8824,Distance/34))))))))","v":2.5647058823529414},{"$f":"IF(ISBLANK(Distance),\"\",IF(Distance>=brevet,IF(brevet>1200,(brevet-1200)*75/1000+90,Max_time),IF(Distance>1200,(Distance-1200)*75/1000+90,IF(Distance>1000,(Distance-1000)/(1000/75)+75,IF(Distance>600,(Distance-600)/(400/35)+40,Distance/15)))))","v":5.8133333333333335},{"$f":"IF(ISBLANK(Distance),\"\",Open_time Control_1+(INT(Open)&\":\"&IF(ROUND(((Open-INT(Open))*60),0)<10,0,\"\")&ROUND(((Open-INT(Open))*60),0)))","v":"2014-06-14T05:34:00"},{"$f":"IF(ISBLANK(Distance),\"\",Open_time Control_1+(INT(Close)&\":\"&IF(ROUND(((Close-INT(Close))*60),0)<10,0,\"\")&ROUND(((Close-INT(Close))*60),0)))","v":"2014-06-14T08:49:00"}]
[null,null,"Control 3",115.2,"CEDAR","Street no. \n","of ","Wheatsheaf Pub?",{"$f":"IF(ISBLANK(Distance),\"\",IF(Distance>1000,(Distance-1000)/26+33.0847,(IF(Distance>600,(Distance-600)/28+18.799,(IF(Distance>400,(Distance-400)/30+12.1324,(IF(Distance>200,(Distance-200)/32+5.8824,Distance/34))))))))","v":3.388235294117647},{"$f":"IF(ISBLANK(Distance),\"\",IF(Distance>=brevet,IF(brevet>1200,(brevet-1200)*75/1000+90,Max_time),IF(Distance>1200,(Distance-1200)*75/1000+90,IF(Distance>1000,(Distance-1000)/(1000/75)+75,IF(Distance>600,(Distance-600)/(400/35)+40,Distance/15)))))","v":7.6800000000000006},{"$f":"IF(ISBLANK(Distance),\"\",Open_time Control_1+(INT(Open)&\":\"&IF(ROUND(((Open-INT(Open))*60),0)<10,0,\"\")&ROUND(((Open-INT(Open))*60),0)))","v":"2014-06-14T06:23:00"},{"$f":"IF(ISBLANK(Distance),\"\",Open_time Control_1+(INT(Close)&\":\"&IF(ROUND(((Close-INT(Close))*60),0)<10,0,\"\")&ROUND(((Close-INT(Close))*60),0)))","v":"2014-06-14T10:41:00"}]
[null,null,"Control 4",141.69999999999999,"DOVER BAY","Mohawk Gas Station","Dover @ Blueback",null,{"$f":"IF(ISBLANK(Distance),\"\",IF(Distance>1000,(Distance-1000)/26+33.0847,(IF(Distance>600,(Distance-600)/28+18.799,(IF(Distance>400,(Distance-400)/30+12.1324,(IF(Distance>200,(Distance-200)/32+5.8824,Distance/34))))))))","v":4.1676470588235288},9.4466666666666654,{"$f":"IF(ISBLANK(Distance),\"\",Open_time Control_1+(INT(Open)&\":\"&IF(ROUND(((Open-INT(Open))*60),0)<10,0,\"\")&ROUND(((Open-INT(Open))*60),0)))","v":"2014-06-14T07:10:00"},{"$f":"IF(ISBLANK(Distance),\"\",Open_time Control_1+(INT(Close)&\":\"&IF(ROUND(((Close-INT(Close))*60),0)<10,0,\"\")&ROUND(((Close-INT(Close))*60),0)))","v":"2014-06-14T12:27:00"}]
[null,null,"Control 5",245.4,"COMOX","Your choice",null,null,7.3011499999999998,16.36,{"$f":"IF(ISBLANK(Distance),\"\",Open_time Control_1+(INT(Open)&\":\"&IF(ROUND(((Open-INT(Open))*60),0)<10,0,\"\")&ROUND(((Open-INT(Open))*60),0)))","v":"2014-06-14T10:18:00"},{"$f":"IF(ISBLANK(Distance),\"\",Open_time Control_1+(INT(Close)&\":\"&IF(ROUND(((Close-INT(Close))*60),0)<10,0,\"\")&ROUND(((Close-INT(Close))*60),0)))","v":"2014-06-14T19:22:00"}]
[null,null,"Control 6",307.3,"CAMPBELL RIVER",null,"Mohawk Gas Station",null,9.2355249999999991,20.486666666666668,{"$f":"IF(ISBLANK(Distance),\"\",Open_time Control_1+(INT(Open)&\":\"&IF(ROUND(((Open-INT(Open))*60),0)<10,0,\"\")&ROUND(((Open-INT(Open))*60),0)))","v":"2014-06-14T12:14:00"},{"$f":"IF(ISBLANK(Distance),\"\",Open_time Control_1+(INT(Close)&\":\"&IF(ROUND(((Close-INT(Close))*60),0)<10,0,\"\")&ROUND(((Close-INT(Close))*60),0)))","v":"2014-06-14T23:29:00"}]
[null,null,"Control 7",396,"GOLD RIVER","GOLD RIVER","CHALET PARKING","How many flagpoles?",12.007400000000001,26.4,{"$f":"IF(ISBLANK(Distance),\"\",Open_time Control_1+(INT(Open)&\":\"&IF(ROUND(((Open-INT(Open))*60),0)<10,0,\"\")&ROUND(((Open-INT(Open))*60),0)))","v":"2014-06-14T15:00:00"},{"$f":"IF(ISBLANK(Distance),\"\",Open_time Control_1+(INT(Close)&\":\"&IF(ROUND(((Close-INT(Close))*60),0)<10,0,\"\")&ROUND(((Close-INT(Close))*60),0)))","v":"2014-06-15T05:24:00"}]
[null,null,"Control 8",484.5,"CAMPBELL RIVER",null,"Mohawk Gas Station",null,14.949066666666667,32.299999999999997,{"$f":"IF(ISBLANK(Distance),\"\",Open_time Control_1+(INT(Open)&\":\"&IF(ROUND(((Open-INT(Open))*60),0)<10,0,\"\")&ROUND(((Open-INT(Open))*60),0)))","v":"2014-06-14T17:57:00"},{"$f":"IF(ISBLANK(Distance),\"\",Open_time Control_1+(INT(Close)&\":\"&IF(ROUND(((Close-INT(Close))*60),0)<10,0,\"\")&ROUND(((Close-INT(Close))*60),0)))","v":"2014-06-15T11:18:00"}]
[null,null,"Control 9",543,"COMOX","Your choice",null,"Name of Mall?",16.899066666666666,36.200000000000003,{"$f":"IF(ISBLANK(Distance),\"\",Open_time Control_1+(INT(Open)&\":\"&IF(ROUND(((Open-INT(Open))*60),0)<10,0,\"\")&ROUND(((Open-INT(Open))*60),0)))","v":"2014-06-14T19:54:00"},{"$f":"IF(ISBLANK(Distance),\"\",Open_time Control_1+(INT(Close)&\":\"&IF(ROUND(((Close-INT(Close))*60),0)<10,0,\"\")&ROUND(((Close-INT(Close))*60),0)))","v":"2014-06-15T15:12:00"}]
[null,null,"Control 10",557.20000000000005,"CUMBERLAND","Name of Service Station?","(Bevan & Cumberland Rds)",null,17.372400000000003,37.146666666666668,{"$f":"IF(ISBLANK(Distance),\"\",Open_time Control_1+(INT(Open)&\":\"&IF(ROUND(((Open-INT(Open))*60),0)<10,0,\"\")&ROUND(((Open-INT(Open))*60),0)))","v":"2014-06-14T20:22:00"},{"$f":"IF(ISBLANK(Distance),\"\",Open_time Control_1+(INT(Close)&\":\"&IF(ROUND(((Close-INT(Close))*60),0)<10,0,\"\")&ROUND(((Close-INT(Close))*60),0)))","v":"2014-06-15T16:09:00"}]
[null,null,"Control 11",662.9,"PORT ALBERNI","7-11 Convenience Store",null,null,21.04542857142857,45.503749999999997,{"$f":"IF(ISBLANK(Distance),\"\",Open_time Control_1+(INT(Open)&\":\"&IF(ROUND(((Open-INT(Open))*60),0)<10,0,\"\")&ROUND(((Open-INT(Open))*60),0)))","v":"2014-06-15T00:03:00"},{"$f":"IF(ISBLANK(Distance),\"\",Open_time Control_1+(INT(Close)&\":\"&IF(ROUND(((Close-INT(Close))*60),0)<10,0,\"\")&ROUND(((Close-INT(Close))*60),0)))","v":"2014-06-16T00:30:00"}]
[null,null,"Control 12",765.7,"NANAIMO","Mohawk Gas Station",null,null,24.716857142857144,54.498750000000001,{"$f":"IF(ISBLANK(Distance),\"\",Open_time Control_1+(INT(Open)&\":\"&IF(ROUND(((Open-INT(Open))*60),0)<10,0,\"\")&ROUND(((Open-INT(Open))*60),0)))","v":"2014-06-15T03:43:00"},{"$f":"IF(ISBLANK(Distance),\"\",Open_time Control_1+(INT(Close)&\":\"&IF(ROUND(((Close-INT(Close))*60),0)<10,0,\"\")&ROUND(((Close-INT(Close))*60),0)))","v":"2014-06-16T09:30:00"}]
[null,null,"Control 13",841,"LAKE COWICHAN","ESSO STATION ","@ MacDONALD","# of gas pumps?",27.406142857142857,61.087499999999999,{"$f":"IF(ISBLANK(Distance),\"\",Open_time Control_1+(INT(Open)&\":\"&IF(ROUND(((Open-INT(Open))*60),0)<10,0,\"\")&ROUND(((Open-INT(Open))*60),0)))","v":"2014-06-15T06:24:00"},{"$f":"IF(ISBLANK(Distance),\"\",Open_time Control_1+(INT(Close)&\":\"&IF(ROUND(((Close-INT(Close))*60),0)<10,0,\"\")&ROUND(((Close-INT(Close))*60),0)))","v":"2014-06-16T16:05:00"}]
[null,null,"Control 14",923.7,"SHAWNIGAN","Your choice","Name of General Store?",null,30.359714285714286,68.323750000000004,{"$f":"IF(ISBLANK(Distance),\"\",Open_time Control_1+(INT(Open)&\":\"&IF(ROUND(((Open-INT(Open))*60),0)<10,0,\"\")&ROUND(((Open-INT(Open))*60),0)))","v":"2014-06-15T09:22:00"},{"$f":"IF(ISBLANK(Distance),\"\",Open_time Control_1+(INT(Close)&\":\"&IF(ROUND(((Close-INT(Close))*60),0)<10,0,\"\")&ROUND(((Close-INT(Close))*60),0)))","v":"2014-06-16T23:19:00"}]
[null,null,"Control 15",955.6,"MILLSTREAM","CO-OP GAS STATION","Signature or ","Opens at what time?",31.499000000000002,71.115000000000009,{"$f":"IF(ISBLANK(Distance),\"\",Open_time Control_1+(INT(Open)&\":\"&IF(ROUND(((Open-INT(Open))*60),0)<10,0,\"\")&ROUND(((Open-INT(Open))*60),0)))","v":"2014-06-15T10:30:00"},{"$f":"IF(ISBLANK(Distance),\"\",Open_time Control_1+(INT(Close)&\":\"&IF(ROUND(((Close-INT(Close))*60),0)<10,0,\"\")&ROUND(((Close-INT(Close))*60),0)))","v":"2014-06-17T02:07:00"}]
[null,null,"Control 16",988,"SIDNEY","7-11 CONVENIENCE STORE",null,null,32.656142857142854,73.949999999999989,{"$f":"IF(ISBLANK(Distance),\"\",Open_time Control_1+(INT(Open)&\":\"&IF(ROUND(((Open-INT(Open))*60),0)<10,0,\"\")&ROUND(((Open-INT(Open))*60),0)))","v":"2014-06-15T11:39:00"},{"$f":"IF(ISBLANK(Distance),\"\",Open_time Control_1+(INT(Close)&\":\"&IF(ROUND(((Close-INT(Close))*60),0)<10,0,\"\")&ROUND(((Close-INT(Close))*60),0)))","v":"2014-06-17T04:57:00"}]
[null,null,"Control 17",1007.2,"VICTORIA","TIM HORTON’S or McDonald's","110-4440 West Saanich Rd.","ROYAL OAK PLAZA, Saanich",33.361623076923074,75,{"$f":"IF(ISBLANK(Distance),\"\",Open_time Control_1+(INT(Open)&\":\"&IF(ROUND(((Open-INT(Open))*60),0)<10,0,\"\")&ROUND(((Open-INT(Open))*60),0)))","v":"2014-06-15T12:22:00"},{"$f":"IF(ISBLANK(Distance),\"\",Open_time Control_1+(INT(Close)&\":\"&IF(ROUND(((Close-INT(Close))*60),0)<10,0,\"\")&ROUND(((Close-INT(Close))*60),0)))","v":"2014-06-17T06:00:00"}]
[null,null,"Control 18",null,null,null,null,null,"","",{"$f":"IF(ISBLANK(Distance),\"\",Open_time Control_1+(INT(Open)&\":\"&IF(ROUND(((Open-INT(Open))*60),0)<10,0,\"\")&ROUND(((Open-INT(Open))*60),0)))","v":""},{"$f":"IF(ISBLANK(Distance),\"\",Open_time Control_1+(INT(Close)&\":\"&IF(ROUND(((Close-INT(Close))*60),0)<10,0,\"\")&ROUND(((Close-INT(Close))*60),0)))","v":""}]
[null,null,"Control 19",null,"SECRET",null,null,null,"",{"$f":"IF(ISBLANK(Distance),\"\",IF(Distance>=brevet,IF(brevet>1200,(brevet-1200)*75/1000+90,Max_time),IF(Distance>1200,(Distance-1200)*75/1000+90,IF(Distance>1000,(Distance-1000)/(1000/75)+75,IF(Distance>600,(Distance-600)/(400/35)+40,Distance/15)))))","v":""},{"$f":"IF(ISBLANK(Distance),\"\",Open_time Control_1+(INT(Open)&\":\"&IF(ROUND(((Open-INT(Open))*60),0)<10,0,\"\")&ROUND(((Open-INT(Open))*60),0)))","v":""},{"$f":"IF(ISBLANK(Distance),\"\",Open_time Control_1+(INT(Close)&\":\"&IF(ROUND(((Close-INT(Close))*60),0)<10,0,\"\")&ROUND(((Close-INT(Close))*60),0)))","v":""}]
[null,null,"Control 20",null,"SECRET",null,null,null,{"$f":"IF(ISBLANK(Distance),\"\",IF(Distance>1000,(Distance-1000)/26+33.0847,(IF(Distance>600,(Distance-600)/28+18.799,(IF(Distance>400,(Distance-400)/30+12.1324,(IF(Distance>200,(Distance-200)/32+5.8824,Distance/34))))))))","v":""},{"$f":"IF(ISBLANK(Distance),\"\",IF(Distance>=brevet,IF(brevet>1200,(brevet-1200)*75/1000+90,Max_time),IF(Distance>1200,(Distance-1200)*75/1000+90,IF(Distance>1000,(Distance-1000)/(1000/75)+75,IF(Distance>600,(Distance-600)/(400/35)+40,Distance/15)))))","v":""},{"$f":"IF(ISBLANK(Distance),\"\",Open_time Control_1+(INT(Open)&\":\"&IF(ROUND(((Open-INT(Open))*60),0)<10,0,\"\")&ROUND(((Open-INT(Open))*60),0)))","v":""},{"$f":"IF(ISBLANK(Distance),\"\",Open_time Control_1+(INT(Close)&\":\"&IF(ROUND(((Close-INT(Close))*60),0)<10,0,\"\")&ROUND(((Close-INT(Close))*60),0)))","v":""}]

{"sheet":"Control Sheet","index":1,"n_rows":64,"n_cols":19,"rows_kept":64,"cut":false,"hidden":false,"merged":[]}
["We thank you for verifying the passage of the Randonneur",null,null,null,null,null,null,"|"]
["DIST (km)","Open","Close","Locale","Establishment","Signature","Time of Passage","|"]
[null,{"$f":"Control_1 Open_time","v":"2014-06-14T03:00:00"},{"$f":"Control_1 Close_time","v":"2014-06-14T04:00:00"},null,{"$f":"IF(ISBLANK(Control_1 Establishment_1),\"\",Control_1 Establishment_1)","v":"Tim Horton's"},null,null,"|"]
[{"$f":"IF(ISBLANK(Distance Control_1),\"\",Control_1 Distance)","v":0},{"$f":"Control_1 Open_time","v":41804.125},{"$f":"Control_1 Close_time","v":41804.166666666664},{"$f":"IF(ISBLANK(Locale Control_1),\"\",Locale Control_1)","v":"VICTORIA"},{"$f":"IF(ISBLANK(Control_1 Establishment_2),\"\",Control_1 Establishment_2)","v":"3501 Ravine Way @"},null,null,"|"]
[null,{"$f":"Control_1 Open_time","v":"2014-06-14T03:00:00"},{"$f":"Control_1 Close_time","v":"2014-06-14T04:00:00"},null,{"$f":"IF(ISBLANK(Control_1 Establishment_3),\"\",Control_1 Establishment_3)","v":"Blanshard"},null,null,"|"]
[null,{"$f":"Control_2 Open_time","v":"2014-06-14T05:34:00"},{"$f":"Control_2 Close_time","v":"2014-06-14T08:49:00"},null,{"$f":"IF(ISBLANK(Control_2 Establishment_1),\"\",Control_2 Establishment_1)","v":"SUBWAY on right "},null,null,"|"]
[{"$f":"IF(ISBLANK(Distance Control_2),\"\",Control_2 Distance)","v":87.2},{"$f":"Control_2 Open_time","v":41804.231944444444},{"$f":"Control_2 Close_time","v":41804.367361111108},{"$f":"IF(ISBLANK(Locale Control_2),\"\",Locale Control_2)","v":"CHEMAINUS"},{"$f":"IF(ISBLANK(Control_2 Establishment_2),\"\",Control_2 Establishment_2)","v":"or your choice"},null,null,"|"]
[null,{"$f":"Control_2 Open_time","v":"2014-06-14T05:34:00"},{"$f":"Control_2 Close_time","v":"2014-06-14T08:49:00"},null,{"$f":"IF(ISBLANK(Control_2 Establishment_3),\"\",Control_2 Establishment_3)","v":"opens at what time?"},null,null,"|",null,"Control Card #2"]
[null,{"$f":"Control_3 Open_time","v":"2014-06-14T06:23:00"},{"$f":"Control_3 Close_time","v":"2014-06-14T10:41:00"},null,{"$f":"IF(ISBLANK(Control_3 Establishment_1),\"\",Control_3 Establishment_1)","v":"Street no. \r"},null,null,"|",null,{"$f":"IF(ISBLANK(brevet),\"\",brevet_nickname&\" \"&brevet&\" km Randonnée\")","v":"VI Eureka  1000 km Randonnée"}]
[{"$f":"IF(ISBLANK(Distance Control_3),\"\",Control_3 Distance)","v":115.2},{"$f":"Control_3 Open_time","v":41804.265972222223},{"$f":"Control_3 Close_time","v":41804.445138888892},{"$f":"IF(ISBLANK(Locale Control_3),\"\",Locale Control_3)","v":"CEDAR"},{"$f":"IF(ISBLANK(Control_3 Establishment_2),\"\",Control_3 Establishment_2)","v":"of "},null,null,"|",null,{"$f":"IF(ISBLANK(Brevet_Description),\"\",Brevet_Description)","v":"Victoria - Gold River - Port Alberni - Cowichan Lake - Sidney - Victoria"}]
[null,{"$f":"Control_3 Open_time","v":"2014-06-14T06:23:00"},{"$f":"Control_3 Close_time","v":"2014-06-14T10:41:00"},null,{"$f":"IF(ISBLANK(Control_3 Establishment_3),\"\",Control_3 Establishment_3)","v":"Wheatsheaf Pub?"},null,null,"|"]
[null,{"$f":"Control_4 Open_time","v":"2014-06-14T07:10:00"},{"$f":"Control_4 Close_time","v":"2014-06-14T12:27:00"},null,{"$f":"IF(ISBLANK(Control_4 Establishment_1),\"\",Control_4 Establishment_1)","v":"Mohawk Gas Station"},null,null,"|",null,"Name",null,{"$f":"IF(ISBLANK(Surname),\"\",First_Name&\" \"&Initial&\" \"&Surname)","v":"  "}]
[{"$f":"IF(ISBLANK(Distance Control_4),\"\",Control_4 Distance)","v":141.69999999999999},{"$f":"Control_4 Open_time","v":41804.298611111109},{"$f":"Control_4 Close_time","v":41804.518750000003},{"$f":"IF(ISBLANK(Locale Control_4),\"\",Locale Control_4)","v":"DOVER BAY"},{"$f":"IF(ISBLANK(Control_4 Establishment_2),\"\",Control_4 Establishment_2)","v":"Dover @ Blueback"},null,null,"|",null,"Address",null,{"$f":"IF(ISBLANK(Address_1),\"\",Address_1)","v":""}]
[null,{"$f":"Control_4 Open_time","v":"2014-06-14T07:10:00"},{"$f":"Control_4 Close_time","v":"2014-06-14T12:27:00"},null,{"$f":"IF(ISBLANK(Control_4 Establishment_3),\"\",Control_4 Establishment_3)","v":""},null,null,"|",null,null,null,{"$f":"IF(ISBLANK(Address_2),\"\",Address_2)","v":""}]
[null,{"$f":"Control_5 Open_time","v":"2014-06-14T10:18:00"},{"$f":"Control_5 Close_time","v":"2014-06-14T19:22:00"},null,{"$f":"IF(ISBLANK(Control_5 Establishment_1),\"\",Control_5 Establishment_1)","v":"Your choice"},null,null,"|",null,"City",null,{"$f":"IF(ISBLANK(City),\"\",City)","v":""},null,null,null,"Province/State",null,null,{"$f":"IF(ISBLANK(Province_State),\"\",Province_State)","v":""}]
[{"$f":"IF(ISBLANK(Distance Control_5),\"\",Control_5 Distance)","v":245.4},{"$f":"Control_5 Open_time","v":41804.429166666669},{"$f":"Control_5 Close_time","v":41804.806944444441},{"$f":"IF(ISBLANK(Locale Control_5),\"\",Locale Control_5)","v":"COMOX"},{"$f":"IF(ISBLANK(Control_5 Establishment_2),\"\",Control_5 Establishment_2)","v":""},null,null,"|",null,"Country",null,{"$f":"IF(ISBLANK(Country),\"\",Country)","v":""},null,null,null,"Postal Code",null,null,{"$f":"IF(ISBLANK(Postal_Code),\"\",Postal_Code)","v":""}]
[null,{"$f":"Control_5 Open_time","v":"2014-06-14T10:18:00"},{"$f":"Control_5 Close_time","v":"2014-06-14T19:22:00"},null,{"$f":"IF(ISBLANK(Control_5 Establishment_3),\"\",Control_5 Establishment_3)","v":""},null,null,"|"]
[null,{"$f":"Control_6 Open_time","v":"2014-06-14T12:14:00"},{"$f":"Control_6 Close_time","v":"2014-06-14T23:29:00"},null,{"$f":"IF(ISBLANK(Control_6 Establishment_1),\"\",Control_6 Establishment_1)","v":""},null,null,"|",null,"Telephone",null,{"$f":"IF(ISBLANK(Home_telephone),\"\",Home_telephone)","v":""},null,null,null,"email",{"$f":"IF(ISBLANK(email),\"\",email)","v":""}]
[{"$f":"IF(ISBLANK(Distance Control_6),\"\",Control_6 Distance)","v":307.3},{"$f":"Control_6 Open_time","v":41804.509722222225},{"$f":"Control_6 Close_time","v":41804.978472222225},{"$f":"IF(ISBLANK(Locale Control_6),\"\",Locale Control_6)","v":"CAMPBELL RIVER"},{"$f":"IF(ISBLANK(Control_6 Establishment_2),\"\",Control_6 Establishment_2)","v":"Mohawk Gas Station"},null,null,"|"]
[null,{"$f":"Control_6 Open_time","v":"2014-06-14T12:14:00"},{"$f":"Control_6 Close_time","v":"2014-06-14T23:29:00"},null,{"$f":"IF(ISBLANK(Control_6 Establishment_3),\"\",Control_6 Establishment_3)","v":""},null,null,"|",null,"Under the sanction of Cycling BC"]
[null,{"$f":"Control_7 Open_time","v":"2014-06-14T15:00:00"},{"$f":"Control_7 Close_time","v":"2014-06-15T05:24:00"},null,{"$f":"IF(ISBLANK(Control_7 Establishment_1),\"\",Control_7 Establishment_1)","v":"GOLD RIVER"},null,null,"|",null,"Founding member of LES RANDONNEURS MONDIAUX (1983)"]
[{"$f":"IF(ISBLANK(Distance Control_7),\"\",Control_7 Distance)","v":396},{"$f":"Control_7 Open_time","v":41804.625},{"$f":"Control_7 Close_time","v":41805.224999999999},{"$f":"IF(ISBLANK(Locale Control_7),\"\",Locale Control_7)","v":"GOLD RIVER"},{"$f":"IF(ISBLANK(Control_7 Establishment_2),\"\",Control_7 Establishment_2)","v":"CHALET PARKING"},null,null,"|"]
[null,{"$f":"Control_7 Open_time","v":"2014-06-14T15:00:00"},{"$f":"Control_7 Close_time","v":"2014-06-15T05:24:00"},null,{"$f":"IF(ISBLANK(Control_7 Establishment_3),\"\",Control_7 Establishment_3)","v":"How many flagpoles?"},null,null,"|",null,"Each Randonneur must carry a Control Card, have it signed at the control between the opening and closing times, and return it to the organizer."]
[null,{"$f":"Control_8 Open_time","v":"2014-06-14T17:57:00"},{"$f":"Control_8 Close_time","v":"2014-06-15T11:18:00"},null,{"$f":"IF(ISBLANK(Control_8 Establishment_1),\"\",Control_8 Establishment_1)","v":""},null,null,"|",null,"Date",{"$f":"IF(ISBLANK(Start_date),\"\",Start_date)","v":"2014-06-14"},null,null,null,"Start time"]
[{"$f":"IF(ISBLANK(Distance Control_8),\"\",Control_8 Distance)","v":484.5},{"$f":"Control_8 Open_time","v":41804.747916666667},{"$f":"Control_8 Close_time","v":41805.470833333333},{"$f":"IF(ISBLANK(Locale Control_8),\"\",Locale Control_8)","v":"CAMPBELL RIVER"},{"$f":"IF(ISBLANK(Control_8 Establishment_2),\"\",Control_8 Establishment_2)","v":"Mohawk Gas Station"},null,null,"|",null,null,null,null,null,null,"Finish time"]
[null,{"$f":"Control_8 Open_time","v":"2014-06-14T17:57:00"},{"$f":"Control_8 Close_time","v":"2014-06-15T11:18:00"},null,{"$f":"IF(ISBLANK(Control_8 Establishment_3),\"\",Control_8 Establishment_3)","v":""},null,null,"|",null,null,null,null,null,null,"Elapsed time"]
[null,{"$f":"Control_9 Open_time","v":"2014-06-14T19:54:00"},{"$f":"Control_9 Close_time","v":"2014-06-15T15:12:00"},null,{"$f":"IF(ISBLANK(Control_9 Establishment_1),\"\",Control_9 Establishment_1)","v":"Your choice"},null,null,"|",null,"Rider's signature at completion"]
[{"$f":"IF(ISBLANK(Distance Control_9),\"\",Control_9 Distance)","v":543},{"$f":"Control_9 Open_time","v":41804.82916666667},{"$f":"Control_9 Close_time","v":41805.633333333331},{"$f":"IF(ISBLANK(Locale Control_9),\"\",Locale Control_9)","v":"COMOX"},{"$f":"IF(ISBLANK(Control_9 Establishment_2),\"\",Control_9 Establishment_2)","v":""},null,null,"|",null,null,null,"Randonneur Committee Authorization"]
[null,{"$f":"Control_9 Open_time","v":"2014-06-14T19:54:00"},{"$f":"Control_9 Close_time","v":"2014-06-15T15:12:00"},null,{"$f":"IF(ISBLANK(Control_9 Establishment_3),\"\",Control_9 Establishment_3)","v":"Name of Mall?"},null,null,"|"]
[null,{"$f":"Control_10 Open_time","v":"2014-06-14T20:22:00"},{"$f":"Control_10 Close_time","v":"2014-06-15T16:09:00"},null,{"$f":"IF(ISBLANK(Control_10 Establishment_1),\"\",Control_10 Establishment_1)","v":"Name of Service Station?"},null,null,"|",null,null,null,null,null,null,null,null,null,null,"msg (250) 598-4135"]
[{"$f":"IF(ISBLANK(Distance Control_10),\"\",Control_10 Distance)","v":557.20000000000005},{"$f":"Control_10 Open_time","v":41804.848611111112},{"$f":"Control_10 Close_time","v":41805.67291666667},{"$f":"IF(ISBLANK(Locale Control_10),\"\",Locale Control_10)","v":"CUMBERLAND"},{"$f":"IF(ISBLANK(Control_10 Establishment_2),\"\",Control_10 Establishment_2)","v":"(Bevan & Cumberland Rds)"},null,null,"|"]
[null,{"$f":"Control_10 Open_time","v":"2014-06-14T20:22:00"},{"$f":"Control_10 Close_time","v":"2014-06-15T16:09:00"},null,{"$f":"IF(ISBLANK(Control_10 Establishment_3),\"\",Control_10 Establishment_3)","v":""},null,null,"|",null,null,null,"Brevet No.",null,{"$f":"IF(ISBLANK(Brevet_Number),\"\",Brevet_Number)","v":"VI1000B"}]
[]
[]
[null,{"$f":"Control_11 Open_time","v":"2014-06-15T00:03:00"},{"$f":"Control_11 Close_time","v":"2014-06-16T00:30:00"},null,{"$f":"IF(ISBLANK(Control_11 Establishment_1),\"\",Control_11 Establishment_1)","v":"7-11 Convenience Store"},null,null,"|"]
[{"$f":"IF(ISBLANK(Distance Control_11),\"\",Control_11 Distance)","v":662.9},{"$f":"Control_11 Open_time","v":41805.002083333333},{"$f":"Control_11 Close_time","v":41806.020833333336},{"$f":"IF(ISBLANK(Locale Control_11),\"\",Locale Control_11)","v":"PORT ALBERNI"},{"$f":"IF(ISBLANK(Control_11 Establishment_2),\"\",Control_11 Establishment_2)","v":""},null,null,"|"]
[null,{"$f":"Control_11 Open_time","v":"2014-06-15T00:03:00"},{"$f":"Control_11 Close_time","v":"2014-06-16T00:30:00"},null,{"$f":"IF(ISBLANK(Control_11 Establishment_3),\"\",Control_11 Establishment_3)","v":""},null,null,"|"]
[null,{"$f":"Control_12 Open_time","v":"2014-06-15T03:43:00"},{"$f":"Control_12 Close_time","v":"2014-06-16T09:30:00"},null,{"$f":"IF(ISBLANK(Control_12 Establishment_1),\"\",Control_12 Establishment_1)","v":"Mohawk Gas Station"},null,null,"|"]
[{"$f":"IF(ISBLANK(Distance Control_12),\"\",Control_12 Distance)","v":765.7},{"$f":"Control_12 Open_time","v":41805.154861111114},{"$f":"Control_12 Close_time","v":41806.395833333336},{"$f":"IF(ISBLANK(Locale Control_12),\"\",Locale Control_12)","v":"NANAIMO"},{"$f":"IF(ISBLANK(Control_12 Establishment_2),\"\",Control_12 Establishment_2)","v":""},null,null,"|"]
[null,{"$f":"Control_12 Open_time","v":"2014-06-15T03:43:00"},{"$f":"Control_12 Close_time","v":"2014-06-16T09:30:00"},null,{"$f":"IF(ISBLANK(Control_12 Establishment_3),\"\",Control_12 Establishment_3)","v":""},null,null,"|",null,"Control Card #1"]
[null,{"$f":"Control_13 Open_time","v":"2014-06-15T06:24:00"},{"$f":"Control_13 Close_time","v":"2014-06-16T16:05:00"},null,{"$f":"IF(ISBLANK(Control_13 Establishment_1),\"\",Control_13 Establishment_1)","v":"ESSO STATION "},null,null,"|",null,{"$f":"IF(ISBLANK(brevet),\"\",brevet_nickname&\" \"&brevet&\" km Randonnée\")","v":"VI Eureka  1000 km Randonnée"}]
[{"$f":"IF(ISBLANK(Distance Control_13),\"\",Control_13 Distance)","v":841},{"$f":"Control_13 Open_time","v":41805.26666666667},{"$f":"Control_13 Close_time","v":41806.670138888891},{"$f":"IF(ISBLANK(Locale Control_13),\"\",Locale Control_13)","v":"LAKE COWICHAN"},{"$f":"IF(ISBLANK(Control_13 Establishment_2),\"\",Control_13 Establishment_2)","v":"@ MacDONALD"},null,null,"|",null,{"$f":"IF(ISBLANK(Brevet_Description),\"\",Brevet_Description)","v":"Victoria - Gold River - Port Alberni - Cowichan Lake - Sidney - Victoria"}]
[null,{"$f":"Control_13 Open_time","v":"2014-06-15T06:24:00"},{"$f":"Control_13 Close_time","v":"2014-06-16T16:05:00"},null,{"$f":"IF(ISBLANK(Control_13 Establishment_3),\"\",Control_13 Establishment_3)","v":"# of gas pumps?"},null,null,"|"]
[null,{"$f":"Control_14 Open_time","v":"2014-06-15T09:22:00"},{"$f":"Control_14 Close_time","v":"2014-06-16T23:19:00"},null,{"$f":"IF(ISBLANK(Control_14 Establishment_1),\"\",Control_14 Establishment_1)","v":"Your choice"},null,null,"|",null,"Name",null,{"$f":"IF(ISBLANK(Surname),\"\",First_Name&\" \"&Initial&\" \"&Surname)","v":"  "}]
[{"$f":"IF(ISBLANK(Distance Control_14),\"\",Control_14 Distance)","v":923.7},{"$f":"Control_14 Open_time","v":41805.390277777777},{"$f":"Control_14 Close_time","v":41806.97152777778},{"$f":"IF(ISBLANK(Locale Control_14),\"\",Locale Control_14)","v":"SHAWNIGAN"},{"$f":"IF(ISBLANK(Control_14 Establishment_2),\"\",Control_14 Establishment_2)","v":"Name of General Store?"},null,null,"|",null,"Address",null,{"$f":"IF(ISBLANK(Address_1),\"\",Address_1)","v":""}]
[null,{"$f":"Control_14 Open_time","v":"2014-06-15T09:22:00"},{"$f":"Control_14 Close_time","v":"2014-06-16T23:19:00"},null,{"$f":"IF(ISBLANK(Control_14 Establishment_3),\"\",Control_14 Establishment_3)","v":""},null,null,"|",null,null,null,{"$f":"IF(ISBLANK(Address_2),\"\",Address_2)","v":""}]
[null,{"$f":"Control_15 Open_time","v":"2014-06-15T10:30:00"},{"$f":"Control_15 Close_time","v":"2014-06-17T02:07:00"},null,{"$f":"IF(ISBLANK(Control_15 Establishment_1),\"\",Control_15 Establishment_1)","v":"CO-OP GAS STATION"},null,null,"|",null,"City",null,{"$f":"IF(ISBLANK(City),\"\",City)","v":""},null,null,null,"Province/State",null,null,{"$f":"IF(ISBLANK(Province_State),\"\",Province_State)","v":""}]
[{"$f":"IF(ISBLANK(Distance Control_15),\"\",Control_15 Distance)","v":955.6},{"$f":"Control_15 Open_time","v":41805.4375},{"$f":"Control_15 Close_time","v":41807.088194444441},{"$f":"IF(ISBLANK(Locale Control_15),\"\",Locale Control_15)","v":"MILLSTREAM"},{"$f":"IF(ISBLANK(Control_15 Establishment_2),\"\",Control_15 Establishment_2)","v":"Signature or "},null,null,"|",null,"Country",null,{"$f":"IF(ISBLANK(Country),\"\",Country)","v":""},null,null,null,"Postal Code",null,null,{"$f":"IF(ISBLANK(Postal_Code),\"\",Postal_Code)","v":""}]
[null,{"$f":"Control_15 Open_time","v":"2014-06-15T10:30:00"},{"$f":"Control_15 Close_time","v":"2014-06-17T02:07:00"},null,{"$f":"IF(ISBLANK(Control_15 Establishment_3),\"\",Control_15 Establishment_3)","v":"Opens at what time?"},null,null,"|"]
[null,{"$f":"Control_16 Open_time","v":"2014-06-15T11:39:00"},{"$f":"Control_16 Close_time","v":"2014-06-17T04:57:00"},null,{"$f":"IF(ISBLANK(Control_16 Establishment_1),\"\",Control_16 Establishment_1)","v":"7-11 CONVENIENCE STORE"},null,null,"|",null,"Telephone",null,{"$f":"IF(ISBLANK(Home_telephone),\"\",Home_telephone)","v":""},null,null,null,"email",{"$f":"IF(ISBLANK(email),\"\",email)","v":""}]
[{"$f":"IF(ISBLANK(Distance Control_16),\"\",Control_16 Distance)","v":988},{"$f":"Control_16 Open_time","v":41805.48541666667},{"$f":"Control_16 Close_time","v":41807.206250000003},{"$f":"IF(ISBLANK(Locale Control_16),\"\",Locale Control_16)","v":"SIDNEY"},{"$f":"IF(ISBLANK(Control_16 Establishment_2),\"\",Control_16 Establishment_2)","v":""},null,null,"|"]
[null,{"$f":"Control_16 Open_time","v":"2014-06-15T11:39:00"},{"$f":"Control_16 Close_time","v":"2014-06-17T04:57:00"},null,{"$f":"IF(ISBLANK(Control_16 Establishment_3),\"\",Control_16 Establishment_3)","v":""},null,null,"|",null,"Under the sanction of Cycling BC"]
[null,{"$f":"Control_17 Open_time","v":"2014-06-15T12:22:00"},{"$f":"Control_17 Close_time","v":"2014-06-17T06:00:00"},null,{"$f":"IF(ISBLANK(Control_17 Establishment_1),\"\",Control_17 Establishment_1)","v":"TIM HORTON’S or McDonald's"},null,null,"|",null,"Founding member of LES RANDONNEURS MONDIAUX (1983)"]
[{"$f":"IF(ISBLANK(Distance Control_17),\"\",Control_17 Distance)","v":1007.2},{"$f":"Control_17 Open_time","v":41805.515277777777},{"$f":"Control_17 Close_time","v":41807.25},{"$f":"IF(ISBLANK(Locale Control_17),\"\",Locale Control_17)","v":"VICTORIA"},{"$f":"IF(ISBLANK(Control_17 Establishment_2),\"\",Control_17 Establishment_2)","v":"110-4440 West Saanich Rd."},null,null,"|"]
[null,{"$f":"Control_17 Open_time","v":"2014-06-15T12:22:00"},{"$f":"Control_17 Close_time","v":"2014-06-17T06:00:00"},null,{"$f":"IF(ISBLANK(Control_17 Establishment_3),\"\",Control_17 Establishment_3)","v":"ROYAL OAK PLAZA, Saanich"},null,null,"|",null,"Each Randonneur must carry a Control Card, have it signed at the control between the opening and closing times, and return it to the organizer."]
[null,{"$f":"Control_18 Open_time","v":""},{"$f":"Control_18 Close_time","v":""},null,{"$f":"IF(ISBLANK(Control_18 Establishment_1),\"\",Control_18 Establishment_1)","v":""},null,null,"|",null,"Date",{"$f":"IF(ISBLANK(Start_date),\"\",Start_date)","v":"2014-06-14"},null,null,null,"Start time"]
[{"$f":"IF(ISBLANK(Distance Control_18),\"\",Control_18 Distance)","v":""},{"$f":"Control_18 Open_time","v":""},{"$f":"Control_18 Close_time","v":""},{"$f":"IF(ISBLANK(Locale Control_18),\"\",Locale Control_18)","v":""},{"$f":"IF(ISBLANK(Control_18 Establishment_2),\"\",Control_18 Establishment_2)","v":""},null,null,"|",null,null,null,null,null,null,"Finish time"]
[null,{"$f":"Control_18 Open_time","v":""},{"$f":"Control_18 Close_time","v":""},null,{"$f":"IF(ISBLANK(Control_18 Establishment_3),\"\",Control_18 Establishment_3)","v":""},null,null,"|",null,null,null,null,null,null,"Elapsed time"]
[null,{"$f":"Control_19 Open_time","v":""},{"$f":"Control_19 Close_time","v":""},null,{"$f":"IF(ISBLANK(Control_19 Establishment_1),\"\",Control_19 Establishment_1)","v":""},null,null,"|",null,"Rider's signature at completion"]
[{"$f":"IF(ISBLANK(Distance Control_19),\"\",Control_19 Distance)","v":""},{"$f":"Control_19 Open_time","v":""},{"$f":"Control_19 Close_time","v":""},{"$f":"IF(ISBLANK(Locale Control_19),\"\",Locale Control_19)","v":"SECRET"},{"$f":"IF(ISBLANK(Control_19 Establishment_2),\"\",Control_19 Establishment_2)","v":""},null,null,"|",null,null,null,"Randonneur Committee Authorization"]
[null,{"$f":"Control_19 Open_time","v":""},{"$f":"Control_19 Close_time","v":""},null,{"$f":"IF(ISBLANK(Control_19 Establishment_3),\"\",Control_19 Establishment_3)","v":""},null,null,"|"]
[null,{"$f":"Control_20 Open_time","v":""},{"$f":"Control_20 Close_time","v":""},null,{"$f":"IF(ISBLANK(Control_20 Establishment_1),\"\",Control_20 Establishment_1)","v":""},null,null,"|",null,null,null,null,null,null,null,null,null,null,"msg (250) 598-4135"]
[{"$f":"IF(ISBLANK(Distance Control_20),\"\",Control_20 Distance)","v":""},{"$f":"Control_20 Open_time","v":""},{"$f":"Control_20 Close_time","v":""},{"$f":"IF(ISBLANK(Locale Control_20),\"\",Locale Control_20)","v":"SECRET"},{"$f":"IF(ISBLANK(Control_20 Establishment_2),\"\",Control_20 Establishment_2)","v":""},null,null,"|"]
[null,{"$f":"Control_20 Open_time","v":""},{"$f":"Control_20 Close_time","v":""},null,{"$f":"IF(ISBLANK(Control_20 Establishment_3),\"\",Control_20 Establishment_3)","v":""},null,null,"|",null,null,null,"Brevet No.",null,{"$f":"IF(ISBLANK(Brevet_Number),\"\",Brevet_Number)","v":"VI1000B"}]

{"sheet":"Riders","index":2,"n_rows":38,"n_cols":18,"rows_kept":38,"cut":false,"hidden":false,"merged":[]}
[null,"Surname","First Name","Initial","Address 1","Address 2","City","Province/State","Country","Postal Code","Home telephone","Work telephone","Fax","email","Finish Time","Codes","Rand Memb","Pin"]
[null,{"$f":"IF(ISBLANK(B3),\"\",B3)","v":""},"","","","","","","","","","","",""]
[1]
[]
[]
[]
[]
[]
[]
[]
[]
[]
[]
[]
[]
[]
[]
[]
[]
[]
[]
[]
[]
[]
[]
[]
[]
[]
[]
[]
[]
[]
[]
[null,null,null,null,null,null,null,null,null,null,null,null,null,null,null,"r - 1/2 hr - route violation"]
[null,null,null,null,null,null,null,null,null,null,null,null,null,null,null,"l - 1/2 hr - no lights"]
[null,null,null,null,null,null,null,null,null,null,null,null,null,null,null,"f - 1/2 hr - no fenders"]
[null,null,null,null,null,null,null,null,null,null,null,null,null,null,null,"e - rode early"]
[null,null,null,null,null,null,null,null,null,null,null,null,null,null,null,"d - rode late"]

{"sheet":"Web Page (km)","index":3,"n_rows":249,"n_cols":8,"rows_kept":249,"cut":false,"hidden":false,"merged":[]}
["At  km","from\nControl","Turn","onto  ROUTE"," then   Go km"]
[0,0,null,"CONTROL #1 - START - \nVictoria Tim Horton's \n3501 Ravine Way @ Blanchard",null,"Go to 100 km point"]
[0,0,"L","RAVINE WAY @ Stop Sign",{"$f":"A4-A3","v":0.1},"Go to 200 km point"]
[0.1,0.1,"SO","Cross Blanchard (@lights)",{"$f":"A5-A4","v":0.1},"Go to 300 km point"]
[0.2,0.2,"L","CAREY",0.2,"Go to 400 km point"]
[0.4,0.4,"R","TRANS CANADA HIGHWAY #1 (N)",3.6999999999999997,"Go to 500 km point"]
[4.0999999999999996,4.0999999999999996,"R","EXIT #8 (Helmcken)",0.5,"Go to 600 km point"]
[4.5999999999999996,4.5999999999999996,"SO","Cross Helmcken onto on-ramp",0.30000000000000071,"Go to 700 km point"]
[4.9000000000000004,4.9000000000000004,"SO","HWY #1 ",0.5,"Go to 800 km point"]
[5.4,5.4,"R","EXIT #10 (Colwood)",0.39999999999999947,"Go to 900 km point"]
[5.8,5.8,"L","HWY #14 (left lane to Colwood)",0.70000000000000018]
[6.5,6.5,"SO","AT LIGHTS",0.5]
[7,7,"R","6 MILE ROAD",0.90000000000000036]
[7.9,7.9,"L","To Hwy #1 N (NANAIMO)",0.29999999999999893,"Start at Control #1"]
[8.1999999999999993,8.1999999999999993,"L","ENTER Hwy #1 North",1.8000000000000007,"Go to Control #2",null,"title"]
[10,10,"R","EXIT #14 (Millstream)",0.19999999999999929,"Go to Control #3",null,"Victoria - Gold river - Port Alberni - Cowichan lake - Sydney - Victoria"]
[10.199999999999999,10.199999999999999,null,"OFF-RAMP to Langford",0.20000000000000107,"Go to Control #4"]
[10.4,10.4,"L","USE CAUTION",{"$f":"A19-A18","v":9.9999999999999645E-2},"Go to Control #5"]
[10.5,10.5,"R","BIKE ROUTE Hwy #1 North (immediately after overpass)",{"$f":"A20-A19","v":0.30000000000000071},"Go to Control #6"]
[10.8,10.8,"R","HIGHWAY #1 (north) ",{"$f":"A21-A20","v":0.89999999999999858},"Go to Control #7"]
[11.7,11.7,"SO","Start of intermittent DANGEROUS\nRUMBLE STRIPS BY WHITE FOG\nLINE – PROCEED CAUTIOUSLY\nDOWN ALL HILLS!",{"$f":"A22-A21","v":23.000000000000004},"Go to Control #8"]
[34.700000000000003,34.700000000000003,"R","MILL BAY RD. Exit -Don't Miss!!",0.59999999999999432,"Go to Control #9"]
[35.299999999999997,35.299999999999997,"L","MILL BAY RD. East @ Stop Sign",6.9000000000000057,"Go to Control #10"]
[42.2,42.2,"L","DELOUME RD. => TCH #1",0.19999999999999574,"Go to Control #11"]
[42.4,42.4,"R","ROUTE 1 (TCH)",1.3000000000000043,"Go to Control #12"]
[43.7,43.7,"R","KILMALU RD. (at lights)",0.5,"Go to Control #13"]
[44.2,44.2,"L","TELEGRAPH RD.",8.7999999999999972,"Go to Control #14"]
[53,53,"R","COWICHAN BAY RD @ Stop Sign ",5.7000000000000028,"Go to Control #15"]
[58.7,58.7,"SO","TZOUHALEM RD.",5.1999999999999957,"Go to Control #16"]
[63.9,63.9,"R","INDIAN RD. (No Sign) @ roundabout",0.10000000000000142,"Finish at Control #17"]
[64,64,"VR","MAPLE BAY RD.        ",6]
[70,70,"L","HERD RD. =>Crofton - Don't Miss!!",2.5999999999999943]
[72.599999999999994,72.599999999999994,"R","OSBORNE BAY RD =>Crofton",5.3000000000000114]
[77.900000000000006,77.900000000000006,"L","CHAPLIN ST. (in Crofton)",0.19999999999998863]
[78.099999999999994,78.099999999999994,"VR","CROFTON RD.",3.6000000000000085]
[81.7,81.7,"R","CHEMAINUS RD (No Sign) @ Stop",0.89999999999999147]
[82.6,82.6,"SO","CAUTION - bad bridge surface",3.7000000000000028]
[86.3,86.3,"SO","CHEMAINUS RD thru roundabout",0.90000000000000568]
[87.2,87.2,"R","CONTROL #2 - Chemainus\nSUBWAY on right or your choice",0]
[87.2,{"$f":"A40-A39","v":0},"R","CHEMAINUS RD. - continue north",9.5999999999999943]
[96.8,{"$f":"A41-$A$39","v":9.5999999999999943},"R","HIGHWAY #1 (north) @ lights",3]
[99.8,{"$f":"A42-$A$39","v":12.599999999999994},"R","FIRST AVE. (at lights)",0.10000000000000853]
[99.9,12.700000000000003,"L","ROCKY CREEK RD. @ Stop Sign",1.8999999999999915]
[101.8,14.599999999999994,"SO","Stop Sign",0.10000000000000853]
[101.9,14.700000000000003,"L","MERGE ONTO HWY 1 (No Sign) ",3.0999999999999943]
[105,17.799999999999997,"R","EXIT CEDAR RD => CEDAR",0.29999999999999716]
[105.3,18.099999999999994,"VR","CEDAR RD.",9.2999999999999972]
[114.6,27.399999999999991,"VL","To Stay on CEDAR RD.",0.60000000000000853]
[115.2,{"$f":"A49-$A$49","v":0},"R","CONTROL #3 - Cedar\nAnswer question about\nWheatsheaf Pub - control card",0]
[115.2,{"$f":"A50-$A$49","v":0},"SO","CEDAR RD. - continue north",1.8999999999999915]
[117.1,1.8999999999999915,"L","CEDAR RD. @ Stop - cross bridge",3]
[120.1,4.8999999999999915,"R","ROUTE 1 (TCH) @ lights",4.6000000000000085]
[124.7,9.5,"R","ESPLANADE @ lights -Don't Miss!!",0.39999999999999147]
[125.1,9.8999999999999915,"SO","BECOMES FRONT ST. @ lights",1]
[126.1,10.899999999999991,"R","TERMINAL/HWY 1 - @ lights",0.10000000000000853]
[126.2,11,"VL","Towards HWY 19A N",1.5]
[127.7,12.5,"R","PRINCESS ROYAL AVE.",0.29999999999999716]
[128,12.799999999999997,"L","ESTEVAN",1.0999999999999943]
[129.1,13.899999999999991,"SO","AT STOP ",0]
[129.1,13.899999999999991,"R","DEPARTURE BAY RD.",2]
[131.1,15.899999999999991,"R","HAMMOND BAY RD.",8.8000000000000114]
[139.9,24.700000000000003,"R","BRICKYARD RD.",0.79999999999998295]
[140.69999999999999,25.499999999999986,"L","WALDBANK RD @ Stop bc Dover",1]
[141.69999999999999,{"$f":"A64-$A$64","v":0},"R","CONTROL #4\nMOHAWK GAS STATION\nDover @ Blueback",0]
[141.69999999999999,{"$f":"A65-$A$64","v":0},"R","Continue on Dover",0.80000000000001137]
[142.5,0.80000000000001137,"R","DICKINSON",2.1999999999999886]
[144.69999999999999,3,"R","LANTZVILLE RD - @ Stop",3.6000000000000227]
[148.30000000000001,6.6000000000000227,"VR ","MERGE ONTO HWY 19 N-No Sign ",6]
[154.30000000000001,12.600000000000023,"R","NORTHWEST BAY RD.",9.5999999999999943]
[163.9,22.200000000000017,"L","TOWARDS RTE 19A N",9.9999999999994316E-2]
[164,22.300000000000011,"R","HWY 19A N. @ lights",76.099999999999994]
[240.1,98.4,"R","HWY 19A N. @ lights Courtenay ",9.9999999999994316E-2]
[240.2,98.5,"SO","CAUTION! STEEL GRID BRIDGE",0.10000000000002274]
[240.3,98.600000000000023,"R","COMOX RD. @ lights => Comox",5.0999999999999943]
[245.4,{"$f":"A75-$A$75","v":0},null,"CONTROL #5--COMOX\nYOUR CHOICE",0.5]
[245.9,{"$f":"A76-$A$75","v":0.5},"L","PRICHARD RD",3.5]
[249.4,4,"SO","BECOME MILITARY ROW",1.5999999999999943]
[251,5.5999999999999943,"SO","BECOMES LITTLE RIVER RD",1.9000000000000057]
[252.9,7.5,"L","Stay on LITTLE RIVER RD",0.5]
[253.4,8,"L","WILKINSON",1.0999999999999943]
[254.5,9.0999999999999943,"L","ELLENOR RD @ Stop bc Anderton",2.8999999999999773]
[257.39999999999998,11.999999999999972,"R","RYAN RD @ Lights",1.8000000000000114]
[259.2,13.799999999999983,"R","LERWICK RD @ Lights => C.River",{"$f":"A85-A83","v":3.1999999999999886}]
[null,null,"SO","VETERAN'S MEMORIAL PKWY"]
[262.39999999999998,16.999999999999972,"R","HWY #19A N @ lights",{"$f":"A86-A85","v":42.200000000000045}]
[304.60000000000002,59.200000000000017,"R","HWY #19A @ Lights - Campbell R.",2.6999999999999886]
[307.3,{"$f":"A87-$A$87","v":0},"R","CONTROL #6 - CAMPBELL RIVER\nMOHAWK GAS STATION",0]
[307.3,{"$f":"A88-$A$87","v":0},"SO","HWY 19A N",0.19999999999998863]
[307.5,0.19999999999998863,"SO","at 1st lights - NOT to Port Hardy!!",0.19999999999998863]
[307.7,0.39999999999997726,"SO","HWY 28 @ Lights => Gold River",41.300000000000011]
[349,41.699999999999989,"SO","Strathcona Park Lodge on Right",6.5]
[355.5,48.199999999999989,"R","Stay on HWY 28 - cross bridge ",39.899999999999977]
[395.4,88.099999999999966,"L","MUCHALET DRIVE - Gold River",0.5]
[395.9,88.599999999999966,"R","NIMPKISH DRIVE",0.10000000000002274]
[396,{"$f":"A95-$A$95","v":0},"L","CONTROL #7--GOLD RIVER\nGOLD RIVER CHALET PARKING\nANSWER QUEST. - CNTRL CARD",0]
[396,{"$f":"A96-$A$95","v":0},"U","RETURN TO CAMPELL RIVER",0.10000000000002274]
[396.1,0.10000000000002274,"R","NIMPKISH DRIVE",9.9999999999965894E-2]
[396.2,0.19999999999998863,"L","MUCHALET DRIVE @ Stop",0.5]
[396.7,0.69999999999998863,"R","GOLD RIVER RD/HWY 28 @ Stop",39.600000000000023]
[436.3,40.300000000000011,"L","HWY 28 @ Stop - after bridge",6.6999999999999886]
[443,47,"SO","Strathcona Park Lodge on Left",41.100000000000023]
[484.1,88.100000000000023,"SO","HWY #19A south to Downtown",0.19999999999998863]
[484.3,88.300000000000011,"SO","HWY #19A - 2nd set of lights",0.19999999999998863]
[484.5,{"$f":"A104-$A$104","v":0},"L","CONTROL #8--CAMPBELL RIVER\nMOHAWK GAS STATION",0]
[484.5,{"$f":"A105-$A$104","v":0},"L","Continue on HWY 19A S",2.6999999999999886]
[487.2,2.6999999999999886,"L","HWY 19A S @ Lights",33.900000000000034]
[521.1,36.600000000000023,"L","COLEMAN RD",4.1999999999999318]
[525.29999999999995,40.799999999999955,"R","BATES RD @ Stop => Airport",3.8000000000000682]
[529.1,44.600000000000023,"R","WAVELAND RD. => Airport",3.7999999999999545]
[532.9,48.399999999999977,"L","ELLENOR RD @ Stop",1.3000000000000682]
[534.20000000000005,49.700000000000045,"R","WILKINSON",1.0999999999999091]
[535.29999999999995,50.799999999999955,"R","LITTLE RIVER RD",0.5]
[535.79999999999995,51.299999999999955,"R","Stay on LITTLE RIVER RD ",1.9000000000000909]
[537.70000000000005,53.200000000000045,"SO","MILITARY ROW @ Stop",1.5999999999999091]
[539.29999999999995,54.799999999999955,"SO","MILITARY ROW bc Pritchard Rd.",1.6000000000000227]
[540.9,56.399999999999977,"SO","PRITCHARD RD @ Stop",1.8000000000000682]
[542.70000000000005,58.200000000000045,"VR","COMOX AVE",0.29999999999995453]
[543,{"$f":"A118-$A$118","v":0},null,"CONTROL #9 - COMOX \nYOUR CHOICE or\nANSWER QUEST. - CNTRL CARD",5.2999999999999545]
[548.29999999999995,5.2999999999999545,"L","HWY 19A S @ Lights => Pksville",0.10000000000002274]
[548.4,5.3999999999999773,"CO","CAUTION!! STEEL GRID BRIDGE",0.20000000000004547]
[548.6,5.6000000000000227,"L","HWY 19A S @ Lights",1.5]
[550.1,7.1000000000000227,"R","29th ST => Cumberland",5.5]
[555.6,12.600000000000023,"SO","continue on to CUMBERLAND",1.6000000000000227]
[557.20000000000005,{"$f":"A124-$A$124","v":0},"R","CONTROL #10 - CUMBERLAND\nCumberland Rd + Bevan\nANSWER QUEST. - CNTRL CARD",0.29999999999995453]
[557.5,{"$f":"A125-$A$124","v":0.29999999999995453},"VL","FOURTH ST @ Peace Park",0.5]
[558,0.79999999999995453,"L ","DUNSMUIR AVE",6.7000000000000455]
[564.70000000000005,7.5,"R","HWY 19A S @ Lights=>Union Bay",55.399999999999977]
[620.1,62.899999999999977,"R","MEMORIAL @ Shell Station",0.89999999999997726]
[621,63.799999999999955,"SO","Courtyard Patio Café - Good pie!",2.7999999999999545]
[623.79999999999995,66.599999999999909,"SO","HWY 4W => Port Alberni",1]
[624.79999999999995,67.599999999999909,"R","HILLIERS RD S",4.8000000000000682]
[629.6,72.399999999999977,"R","HWY 4W @ T",29.199999999999932]
[658.8,101.59999999999991,"VR","to stay on HWY 4W",4.1000000000000227]
[662.9,{"$f":"A134-$A$134","v":0},"L","CONTROL #11 - PORT ALBERNI\n7-11 CONVENIENCE STORE",{"$f":"A135-A134","v":0.10000000000002274}]
[663,{"$f":"A135-$A$134","v":0.10000000000002274},"U","Rt. Onto Johnston Rd/HWY 4E",0]
[663,{"$f":"A136-$A$134","v":0.10000000000002274},null,"Towards Parksville",34]
[697,34.100000000000023,"R","PRATT RD",2]
[699,36.100000000000023,"L","GRAFTON AVE",7.2999999999999545]
[706.3,43.399999999999977,"L","ERRINGTON RD",2]
[708.3,45.399999999999977,"R","ALBERNI HWY",2.6000000000000227]
[710.9,48,"R","HWY 19 S =>Nanaimo",5.5]
[716.4,53.5,"R","EXIT 46 TO HWY 19A N",0.60000000000002274]
[717,54.100000000000023,"L","HWY 19A N @ Stop => Pksville",1]
[718,55.100000000000023,"R","FRANKLIN'S GULL/NW BAY-lights",0.10000000000002274]
[718.1,55.200000000000045,"R","NORTH WEST BAY RD",9.6000000000000227]
[727.7,64.800000000000068,"L","ISLAND HWY 19S =>Nanaimo",7.5999999999999091]
[735.3,72.399999999999977,"R","SUPERIOR RD",0.30000000000006821]
[735.6,72.700000000000045,"L","VANDENHOEK",{"$f":"A149-A148","v":0.10000000000002274}]
[735.7,72.800000000000068,"L","HARBY RD W",1.2999999999999545]
[737,74.100000000000023,"SO","Becomes PHILIP RD",0.5]
[737.5,74.600000000000023,"L","AULDS RD",0.10000000000002274]
[737.6,74.700000000000045,"R","To Stay on AULDS RD",2.6999999999999318]
[740.3,77.399999999999977,"SO","Cross NANAIMO PKWY/HWY 19",0.30000000000006821]
[740.6,77.700000000000045,"R","METRAL DRIVE",1.2999999999999545]
[741.9,79,"R","DOUMONT RD",4.3000000000000682]
[746.2,83.300000000000068,"L","BIGGS RD @ Stop ",3.5]
[749.7,86.800000000000068,"R ","JINGLE POT RD",8.0999999999999091]
[757.8,94.899999999999977,"SO","Cross NANAIMO PKWY/HWY 19",0.70000000000004547]
[758.5,95.600000000000023,"VR","JINGLE POT RD becomes THIRD",1.1000000000000227]
[759.6,96.700000000000045,"R","WAKESIAH AVE",1.1999999999999318]
[760.8,97.899999999999977,"L","SIXTH",0.90000000000009095]
[761.7,98.800000000000068,"R","BRUCE AVE",1.5999999999999091]
[763.3,100.39999999999998,"VL","TENTH AVE",2.4000000000000909]
[765.7,{"$f":"A164-$A$164","v":0},"R","CONTROL #12 - NANAIMO\nMOHAWK GAS STATION",0]
[765.7,{"$f":"A165-$A$164","v":0},"R","Right out of Mohawk",9.9999999999909051E-2]
[765.8,9.9999999999909051E-2,"R","TRANS CANADA HWY 1 @Lights",0.5]
[766.3,0.59999999999990905,"L","LEFT LANE FOR CEDAR RD",0.20000000000004547]
[766.5,0.79999999999995453,"L","CEDAR RD @ Lights",3]
[769.5,3.7999999999999545,"R","Stay on CEDAR RD -after bridge!",11.899999999999977]
[781.4,15.699999999999932,"L","HWY 1 @ lights - toward Victoria",30.899999999999977]
[812.3,46.599999999999909,"R","DRINKWATER RD - Tim H. on rt.",1.5]
[813.8,48.099999999999909,"L","SOMENOS RD",1.2000000000000455]
[815,49.299999999999955,"R","COWICHAN LAKE RD @ Rndabt.",1.8999999999999773]
[816.9,51.199999999999932,"L","COWICHAN LAKE RD ",16.399999999999977]
[833.3,67.599999999999909,"SO","Cross SKUTZ FALLS RD @ Stop",5.9000000000000909]
[839.2,73.5,"L","GREENDALE RD",1.5999999999999091]
[840.8,75.099999999999909,"L","COWICHAN LAKE RD @ T-Stop",0.20000000000004547]
[841,{"$f":"A178-$A$178","v":0},"R","CONTROL #13-LAKE COWICHAN\nESSO STATION @ MacDONALD",0]
[841,{"$f":"A179-$A$178","v":0},"U","LEFT ONTO COWICHAN LAKE RD",0.20000000000004547]
[841.2,0.20000000000004547,"R","COWICHN LAKE RD-2nd right turn",7.3999999999999773]
[848.6,7.6000000000000227,"SO","Cross SKUTZ FALLS RD @ Stop",16.399999999999977]
[865,24,"R","TANSOR/COWICHAN LAKE RD",1.7999999999999545]
[866.8,25.799999999999955,"L","SOMENOS RD @ Rndabout",1.3000000000000682]
[868.1,27.100000000000023,"R","DRINKWATER RD @ graveyard",{"$f":"A186-A184","v":1.6000000000000227}]
[null,null,"SO","cross Trans Canada Hwy 1 @ light"]
[869.7,28.700000000000045,"L","BELL MCKINNON RD. Don't Miss!",1.5999999999999091]
[871.3,30.299999999999955,"SO","stay on BELL MCKINNON",3.7000000000000455]
[875,34,"R","WESTHOLME RD @ Stop",3]
[878,37,"SO","becomes CHEMAINUS RD",1.7000000000000455]
[879.7,38.700000000000045,"R","CROFTON RD",3.6999999999999318]
[883.4,42.399999999999977,"R","YORK AVE/OSBORNE BAY RD",5.2000000000000455]
[888.6,47.600000000000023,"L","HERD RD",2.7999999999999545]
[891.4,50.399999999999977,"R","MAPLE BAY RD =>Duncan",6]
[897.4,56.399999999999977,"L","TZOUHALEM -no sign- roundabout",0.20000000000004547]
[897.6,56.600000000000023,"SO","Cowichan Lodge on left",4.8999999999999773]
[902.5,61.5,"SO","COWICHAN BAY RD @ Stop",5.7999999999999545]
[908.3,67.299999999999955,"L","TELEGRAPH RD -School on left",8.7000000000000455]
[917,76,"R","KILMALU RD @ T-Stop",0.60000000000002274]
[917.6,76.600000000000023,"L","TRANS CANADA HWY 1 @Lights",0.79999999999995453]
[918.4,77.399999999999977,"R","SHAWNIGAN/MILL BAY RD -lights",5.3000000000000682]
[923.7,{"$f":"A201-$A$201","v":0},null,"CONTROL #14 - SHAWNIGAN\nYOUR CHOICE or\nANSWER QUEST. - CNTRL CARD",0]
[923.7,{"$f":"A202-$A$201","v":0},"L","SHAWNIGAN LAKE RD @ stop",2.2999999999999545]
[926,2.2999999999999545,"SO ","STOWOOD - up hill",0.70000000000004547]
[926.7,3,"SO","becomes SHAWNIGAN LAKE RD",4.6999999999999318]
[931.4,7.6999999999999318,"SO","CONTINUE STRAIGHT",0.20000000000004547]
[931.6,7.8999999999999773,"VL","UPHILL - SHAWNIGAN LAKE RD",5.6999999999999318]
[937.3,13.599999999999909,"R","TRANS CANADA HWY 1 @ Stop",13]
[950.3,26.599999999999909,"R","GOLDSTREAM AVE",2.2000000000000455]
[952.5,28.799999999999955,"L","SPENCER  Don't Miss!!",0.39999999999997726]
[952.9,29.199999999999932,"SO","Cross Trans Canada Hwy 1 @ light",0.20000000000004547]
[953.1,29.399999999999977,"R","BROCK AVE",0.10000000000002274]
[953.2,29.5,"L","FLORENCE LAKE RD",{"$f":"A213-A212","v":0.69999999999993179}]
[953.9,30.199999999999932,"R","SETCHFIELD RD @ Stop",1]
[954.9,31.199999999999932,"R","TREANOR RD",0.70000000000004547]
[955.6,{"$f":"A215-$A$215","v":0},"L","CONTROL #15- MILLSTREAM\nCO-OP GAS STATION\nSignature or Answer Question",0]
[955.6,{"$f":"A216-$A$215","v":0},"L","MILLSTREAM RD",4.5]
[960.1,4.5,"R","MILLSTREAM LAKE RD - uphill",1]
[961.1,5.5,"L","MILLSTREAM LAKE RD @ STOP",6.1999999999999318]
[967.3,11.699999999999932,"R","WILLIS PT. RD - no sign @ stop",4]
[971.3,15.699999999999932,"L","WALLACE DRIVE",3.2000000000000455]
[974.5,18.899999999999977,"SO","WALLACE DRIVE",2.2000000000000455]
[976.7,21.100000000000023,"SO","Cross W. Saanich Rd @ light",3.5999999999999091]
[980.3,24.699999999999932,"L","EAST SAANICH RD - @ Stop",4.6000000000000227]
[984.9,29.299999999999955,"SO","EAST SAANICH RD -rndabout",0.39999999999997726]
[985.3,29.699999999999932,"L","CANORA",0.70000000000004547]
[986,30.399999999999977,"R","CANSO/OCEAN/STIRLING WAY",1.5]
[987.5,31.899999999999977,"R","BEACON AVE @ Stop",0.10000000000002274]
[987.6,32,"SO","Cross Hwy 17 @ light",0.39999999999997726]
[988,{"$f":"A229-$A$229","v":0},"L","CONTROL #16- SIDNEY\n7-11 CONVENIENCE STORE",0]
[988,{"$f":"A230-$A$229","v":0},"L","BEACON AVE - east",0.10000000000002274]
[988.1,0.10000000000002274,"R","FIFTH ST",0.69999999999993179]
[988.8,0.79999999999995453,"SO","FIFTH ST becomes LOCHSIDE",6]
[994.8,6.7999999999999545,"R","MT.NEWTON X RD @ Stop",0.20000000000004547]
[995,7,"L","ROUTE 17 @ Light",9]
[1004,16,"R","ELK LAKE RD @ Lights",2]
[1006,18,"SO","Cross Royal Oak Ave @ Light",0.29999999999995453]
[1006.3,18.299999999999955,"L","WEST SAANICH RD @ Light",0.70000000000004547]
[1007,19,"R","Shopping Plaza (Co-Op Gas)",0.20000000000004547]
[1007.2,null,"L","CONTROL #17 - FINISH\nTIM HORTON’S or McDonald's\n110-4440 West Saanich Rd.,\nROYAL OAK PLAZA,\nSAANICH"]
[null,null,null,"CONGRATULATIONS!!\n\nROUTE BACK TO THE START",0]
[0,null,"L","onto no name alley",0.1]
[0.1,null,"R","WEST SAANICH RD ",0.4]
[0.5,null,"R","Glanford Ave",2.2999999999999998]
[2.8,null,"SO","Cross McKenzie Ave",0.30000000000000027]
[3.1,null,"L","Carey Rd",0.19999999999999973]
[3.3,null,"SO","Cross Tillicum",1]
[4.3,null,"L","RAVINE WAY (At sign)",0.10000000000000053]
[4.4000000000000004,null,"SO","Cross Blanshard @ light",9.9999999999999645E-2]
[4.5,null,"R","Saanich Plaza & Tim Horton's ",-4.5]

{"sheet":"Route Sheets (prt)","index":4,"n_rows":249,"n_cols":11,"rows_kept":249,"cut":false,"hidden":false,"merged":[]}
["At  km","from\nCon-\ntrol","Turn","onto  ROUTE"," then   Go km",null,"At  km","from\nCon-\ntrol","Turn","onto  ROUTE"," then   Go km"]
[0,0,null,"CONTROL #1 - START - \nVictoria Tim Horton's \n3501 Ravine Way @ Blanchard",null,null,0,0,null,"CONTROL #1 - START - \nVictoria Tim Horton's \n3501 Ravine Way @ Blanchard"]
[0,0,"L","RAVINE WAY @ Stop Sign",{"$f":"A4-A3","v":0.1},null,0,0,"L","RAVINE WAY @ Stop Sign",{"$f":"G4-G3","v":0.1}]
[0.1,0.1,"SO","Cross Blanchard (@lights)",{"$f":"A5-A4","v":0.1},null,0.1,0.1,"SO","Cross Blanchard (@lights)",{"$f":"G5-G4","v":0.1}]
[0.2,0.2,"L","CAREY",0.2,null,0.2,0.2,"L","CAREY",0.2]
[0.4,0.4,"R","TRANS CANADA HIGHWAY #1 (N)",3.6999999999999997,null,0.4,0.4,"R","TRANS CANADA HIGHWAY #1 (N)",3.6999999999999997]
[4.0999999999999996,4.0999999999999996,"R","EXIT #8 (Helmcken)",0.5,null,4.0999999999999996,4.0999999999999996,"R","EXIT #8 (Helmcken)",0.5]
[4.5999999999999996,4.5999999999999996,"SO","Cross Helmcken onto on-ramp",0.30000000000000071,null,4.5999999999999996,4.5999999999999996,"SO","Cross Helmcken onto on-ramp",0.30000000000000071]
[4.9000000000000004,4.9000000000000004,"SO","HWY #1 ",0.5,null,4.9000000000000004,4.9000000000000004,"SO","HWY #1 ",0.5]
[5.4,5.4,"R","EXIT #10 (Colwood)",0.39999999999999947,null,5.4,5.4,"R","EXIT #10 (Colwood)",0.39999999999999947]
[5.8,5.8,"L","HWY #14 (left lane to Colwood)",0.70000000000000018,null,5.8,5.8,"L","HWY #14 (left lane to Colwood)",0.70000000000000018]
[6.5,6.5,"SO","AT LIGHTS",0.5,null,6.5,6.5,"SO","AT LIGHTS",0.5]
[7,7,"R","6 MILE ROAD",0.90000000000000036,null,7,7,"R","6 MILE ROAD",0.90000000000000036]
[7.9,7.9,"L","To Hwy #1 N (NANAIMO)",0.29999999999999893,null,7.9,7.9,"L","To Hwy #1 N (NANAIMO)",0.29999999999999893]
[8.1999999999999993,8.1999999999999993,"L","ENTER Hwy #1 North",1.8000000000000007,null,8.1999999999999993,8.1999999999999993,"L","ENTER Hwy #1 North",1.8000000000000007]
[10,10,"R","EXIT #14 (Millstream)",0.19999999999999929,null,10,10,"R","EXIT #14 (Millstream)",0.19999999999999929]
[10.199999999999999,10.199999999999999,null,"OFF-RAMP to Langford",0.20000000000000107,null,10.199999999999999,10.199999999999999,null,"OFF-RAMP to Langford",0.20000000000000107]
[10.4,10.4,"L","USE CAUTION",{"$f":"A19-A18","v":9.9999999999999645E-2},null,10.4,10.4,"L","USE CAUTION",{"$f":"G19-G18","v":9.9999999999999645E-2}]
[10.5,10.5,"R","BIKE ROUTE Hwy #1 North (immediately after overpass)",{"$f":"A20-A19","v":0.30000000000000071},null,10.5,10.5,"R","BIKE ROUTE Hwy #1 North (immediately after overpass)",{"$f":"G20-G19","v":0.30000000000000071}]
[10.8,10.8,"R","HIGHWAY #1 (north) ",{"$f":"A21-A20","v":0.89999999999999858},null,10.8,10.8,"R","HIGHWAY #1 (north) ",{"$f":"G21-G20","v":0.89999999999999858}]
[11.7,11.7,"SO","Start of intermittent DANGEROUS\nRUMBLE STRIPS BY WHITE FOG\nLINE – PROCEED CAUTIOUSLY\nDOWN ALL HILLS!",{"$f":"A22-A21","v":23.000000000000004},null,11.7,11.7,"SO","Start of intermittent DANGEROUS\nRUMBLE STRIPS BY WHITE FOG\nLINE – PROCEED CAUTIOUSLY\nDOWN ALL HILLS!",{"$f":"G22-G21","v":23.000000000000004}]
[34.700000000000003,34.700000000000003,"R","MILL BAY RD. Exit -Don't Miss!!",0.59999999999999432,null,34.700000000000003,34.700000000000003,"R","MILL BAY RD. Exit -Don't Miss!!",0.59999999999999432]
[35.299999999999997,35.299999999999997,"L","MILL BAY RD. East @ Stop Sign",6.9000000000000057,null,35.299999999999997,35.299999999999997,"L","MILL BAY RD. East @ Stop Sign",6.9000000000000057]
[42.2,42.2,"L","DELOUME RD. => TCH #1",0.19999999999999574,null,42.2,42.2,"L","DELOUME RD. => TCH #1",0.19999999999999574]
[42.4,42.4,"R","ROUTE 1 (TCH)",1.3000000000000043,null,42.4,42.4,"R","ROUTE 1 (TCH)",1.3000000000000043]
[43.7,43.7,"R","KILMALU RD. (at lights)",0.5,null,43.7,43.7,"R","KILMALU RD. (at lights)",0.5]
[44.2,44.2,"L","TELEGRAPH RD.",8.7999999999999972,null,44.2,44.2,"L","TELEGRAPH RD.",8.7999999999999972]
[53,53,"R","COWICHAN BAY RD @ Stop Sign ",5.7000000000000028,null,53,53,"R","COWICHAN BAY RD @ Stop Sign ",5.7000000000000028]
[58.7,58.7,"SO","TZOUHALEM RD.",5.1999999999999957,null,58.7,58.7,"SO","TZOUHALEM RD.",5.1999999999999957]
[63.9,63.9,"R","INDIAN RD. (No Sign) @ roundabout",0.10000000000000142,null,63.9,63.9,"R","INDIAN RD. (No Sign) @ roundabout",0.10000000000000142]
[64,64,"VR","MAPLE BAY RD.        ",6,null,64,64,"VR","MAPLE BAY RD.        ",6]
[70,70,"L","HERD RD. =>Crofton - Don't Miss!!",2.5999999999999943,null,70,70,"L","HERD RD. =>Crofton - Don't Miss!!",2.5999999999999943]
[72.599999999999994,72.599999999999994,"R","OSBORNE BAY RD =>Crofton",5.3000000000000114,null,72.599999999999994,72.599999999999994,"R","OSBORNE BAY RD =>Crofton",5.3000000000000114]
[77.900000000000006,77.900000000000006,"L","CHAPLIN ST. (in Crofton)",0.19999999999998863,null,77.900000000000006,77.900000000000006,"L","CHAPLIN ST. (in Crofton)",0.19999999999998863]
[78.099999999999994,78.099999999999994,"VR","CROFTON RD.",3.6000000000000085,null,78.099999999999994,78.099999999999994,"VR","CROFTON RD.",3.6000000000000085]
[81.7,81.7,"R","CHEMAINUS RD (No Sign) @ Stop",0.89999999999999147,null,81.7,81.7,"R","CHEMAINUS RD (No Sign) @ Stop",0.89999999999999147]
[82.6,82.6,"SO","CAUTION - bad bridge surface",3.7000000000000028,null,82.6,82.6,"SO","CAUTION - bad bridge surface",3.7000000000000028]
[86.3,86.3,"SO","CHEMAINUS RD thru roundabout",0.90000000000000568,null,86.3,86.3,"SO","CHEMAINUS RD thru roundabout",0.90000000000000568]
[87.2,87.2,"R","CONTROL #2 - Chemainus\nSUBWAY on right or your choice",0,null,87.2,87.2,"R","CONTROL #2 - Chemainus\nSUBWAY on right or your choice",0]
[87.2,{"$f":"A40-A39","v":0},"R","CHEMAINUS RD. - continue north",{"$f":"A41-A40","v":9.5999999999999943},null,87.2,{"$f":"G40-G39","v":0},"R","CHEMAINUS RD. - continue north",{"$f":"G41-G40","v":9.5999999999999943}]
[96.8,{"$f":"A41-$A$39","v":9.5999999999999943},"R","HIGHWAY #1 (north) @ lights",{"$f":"A42-A41","v":3},null,96.8,{"$f":"G41-$A$39","v":9.5999999999999943},"R","HIGHWAY #1 (north) @ lights",{"$f":"G42-G41","v":3}]
[99.8,{"$f":"A42-$A$39","v":12.599999999999994},"R","FIRST AVE. (at lights)",{"$f":"A43-A42","v":0.10000000000000853},null,99.8,{"$f":"G42-$A$39","v":12.599999999999994},"R","FIRST AVE. (at lights)",{"$f":"G43-G42","v":0.10000000000000853}]
[99.9,12.700000000000003,"L","ROCKY CREEK RD. @ Stop Sign",1.8999999999999915,null,99.9,12.700000000000003,"L","ROCKY CREEK RD. @ Stop Sign",1.8999999999999915]
[101.8,14.599999999999994,"SO","Stop Sign",0.10000000000000853,null,101.8,14.599999999999994,"SO","Stop Sign",0.10000000000000853]
[101.9,14.700000000000003,"L","MERGE ONTO HWY 1 (No Sign) ",3.0999999999999943,null,101.9,14.700000000000003,"L","MERGE ONTO HWY 1 (No Sign) ",3.0999999999999943]
[105,17.799999999999997,"R","EXIT CEDAR RD => CEDAR",0.29999999999999716,null,105,17.799999999999997,"R","EXIT CEDAR RD => CEDAR",0.29999999999999716]
[105.3,18.099999999999994,"VR","CEDAR RD.",9.2999999999999972,null,105.3,18.099999999999994,"VR","CEDAR RD.",9.2999999999999972]
[114.6,27.399999999999991,"VL","To Stay on CEDAR RD.",0.60000000000000853,null,114.6,27.399999999999991,"VL","To Stay on CEDAR RD.",0.60000000000000853]
[115.2,{"$f":"A49-$A$49","v":0},"R","CONTROL #3 - Cedar\nAnswer question about\nWheatsheaf Pub - control card",0,null,115.2,{"$f":"G49-$A$49","v":0},"R","CONTROL #3 - Cedar\nAnswer question about\nWheatsheaf Pub - control card",0]
[115.2,{"$f":"A50-$A$49","v":0},"SO","CEDAR RD. - continue north",1.8999999999999915,null,115.2,{"$f":"G50-$A$49","v":0},"SO","CEDAR RD. - continue north",1.8999999999999915]
[117.1,1.8999999999999915,"L","CEDAR RD. @ Stop - cross bridge",3,null,117.1,1.8999999999999915,"L","CEDAR RD. @ Stop - cross bridge",3]
[120.1,4.8999999999999915,"R","ROUTE 1 (TCH) @ lights",4.6000000000000085,null,120.1,4.8999999999999915,"R","ROUTE 1 (TCH) @ lights",4.6000000000000085]
[124.7,9.5,"R","ESPLANADE @ lights -Don't Miss!!",0.39999999999999147,null,124.7,9.5,"R","ESPLANADE @ lights -Don't Miss!!",0.39999999999999147]
[125.1,9.8999999999999915,"SO","BECOMES FRONT ST. @ lights",1,null,125.1,9.8999999999999915,"SO","BECOMES FRONT ST. @ lights",1]
[126.1,10.899999999999991,"R","TERMINAL/HWY 1 - @ lights",0.10000000000000853,null,126.1,10.899999999999991,"R","TERMINAL/HWY 1 - @ lights",0.10000000000000853]
[126.2,11,"VL","Towards HWY 19A N",1.5,null,126.2,11,"VL","Towards HWY 19A N",1.5]
[127.7,12.5,"R","PRINCESS ROYAL AVE.",0.29999999999999716,null,127.7,12.5,"R","PRINCESS ROYAL AVE.",0.29999999999999716]
[128,12.799999999999997,"L","ESTEVAN",1.0999999999999943,null,128,12.799999999999997,"L","ESTEVAN",1.0999999999999943]
[129.1,13.899999999999991,"SO","AT STOP ",0,null,129.1,13.899999999999991,"SO","AT STOP ",0]
[129.1,13.899999999999991,"R","DEPARTURE BAY RD.",2,null,129.1,13.899999999999991,"R","DEPARTURE BAY RD.",2]
[131.1,15.899999999999991,"R","HAMMOND BAY RD.",8.8000000000000114,null,131.1,15.899999999999991,"R","HAMMOND BAY RD.",8.8000000000000114]
[139.9,24.700000000000003,"R","BRICKYARD RD.",0.79999999999998295,null,139.9,24.700000000000003,"R","BRICKYARD RD.",0.79999999999998295]
[140.69999999999999,25.499999999999986,"L","WALDBANK RD @ Stop bc Dover",1,null,140.69999999999999,25.499999999999986,"L","WALDBANK RD @ Stop bc Dover",1]
[141.69999999999999,{"$f":"A64-$A$64","v":0},"R","CONTROL #4\nMOHAWK GAS STATION\nDover @ Blueback",0,null,141.69999999999999,{"$f":"G64-$A$64","v":0},"R","CONTROL #4\nMOHAWK GAS STATION\nDover @ Blueback",0]
[141.69999999999999,{"$f":"A65-$A$64","v":0},"R","Continue on Dover",0.80000000000001137,null,141.69999999999999,{"$f":"G65-$A$64","v":0},"R","Continue on Dover",0.80000000000001137]
[142.5,0.80000000000001137,"R","DICKINSON",2.1999999999999886,null,142.5,0.80000000000001137,"R","DICKINSON",2.1999999999999886]
[144.69999999999999,3,"R","LANTZVILLE RD - @ Stop",3.6000000000000227,null,144.69999999999999,3,"R","LANTZVILLE RD - @ Stop",3.6000000000000227]
[148.30000000000001,6.6000000000000227,"VR ","MERGE ONTO HWY 19 N-No Sign ",6,null,148.30000000000001,6.6000000000000227,"VR ","MERGE ONTO HWY 19 N-No Sign ",6]
[154.30000000000001,12.600000000000023,"R","NORTHWEST BAY RD.",{"$f":"A70-A69","v":9.5999999999999943},null,154.30000000000001,12.600000000000023,"R","NORTHWEST BAY RD.",{"$f":"G70-G69","v":9.5999999999999943}]
[163.9,22.200000000000017,"L","TOWARDS RTE 19A N",9.9999999999994316E-2,null,163.9,22.200000000000017,"L","TOWARDS RTE 19A N",9.9999999999994316E-2]
[164,22.300000000000011,"R","HWY 19A N. @ lights",76.099999999999994,null,164,22.300000000000011,"R","HWY 19A N. @ lights",76.099999999999994]
[240.1,98.4,"R","HWY 19A N. @ lights Courtenay ",9.9999999999994316E-2,null,240.1,98.4,"R","HWY 19A N. @ lights Courtenay ",9.9999999999994316E-2]
[240.2,98.5,"SO","CAUTION! STEEL GRID BRIDGE",0.10000000000002274,null,240.2,98.5,"SO","CAUTION! STEEL GRID BRIDGE",0.10000000000002274]
[240.3,98.600000000000023,"R","COMOX RD. @ lights => Comox",5.0999999999999943,null,240.3,98.600000000000023,"R","COMOX RD. @ lights => Comox",5.0999999999999943]
[245.4,{"$f":"A75-$A$75","v":0},null,"CONTROL #5--COMOX\nYOUR CHOICE",0.5,null,245.4,{"$f":"G75-$A$75","v":0},null,"CONTROL #5--COMOX\nYOUR CHOICE",0.5]
[245.9,{"$f":"A76-$A$75","v":0.5},"L","PRICHARD RD",3.5,null,245.9,{"$f":"G76-$A$75","v":0.5},"L","PRICHARD RD",3.5]
[249.4,4,"SO","BECOME MILITARY ROW",1.5999999999999943,null,249.4,4,"SO","BECOME MILITARY ROW",1.5999999999999943]
[251,5.5999999999999943,"SO","BECOMES LITTLE RIVER RD",1.9000000000000057,null,251,5.5999999999999943,"SO","BECOMES LITTLE RIVER RD",1.9000000000000057]
[252.9,7.5,"L","Stay on LITTLE RIVER RD",0.5,null,252.9,7.5,"L","Stay on LITTLE RIVER RD",0.5]
[253.4,8,"L","WILKINSON",1.0999999999999943,null,253.4,8,"L","WILKINSON",1.0999999999999943]
[254.5,9.0999999999999943,"L","ELLENOR RD @ Stop bc Anderton",2.8999999999999773,null,254.5,9.0999999999999943,"L","ELLENOR RD @ Stop bc Anderton",2.8999999999999773]
[257.39999999999998,11.999999999999972,"R","RYAN RD @ Lights",1.8000000000000114,null,257.39999999999998,11.999999999999972,"R","RYAN RD @ Lights",1.8000000000000114]
[259.2,13.799999999999983,"R","LERWICK RD @ Lights => C.River",{"$f":"A85-A83","v":3.1999999999999886},null,259.2,13.799999999999983,"R","LERWICK RD @ Lights => C.River",{"$f":"G85-G83","v":3.1999999999999886}]
[null,null,"SO","VETERAN'S MEMORIAL PKWY",null,null,null,null,"SO","VETERAN'S MEMORIAL PKWY"]
[262.39999999999998,16.999999999999972,"R","HWY #19A N @ lights",{"$f":"A86-A85","v":42.200000000000045},null,262.39999999999998,16.999999999999972,"R","HWY #19A N @ lights",{"$f":"G86-G85","v":42.200000000000045}]
[304.60000000000002,59.200000000000017,"R","HWY #19A @ Lights - Campbell R.",2.6999999999999886,null,304.60000000000002,59.200000000000017,"R","HWY #19A @ Lights - Campbell R.",2.6999999999999886]
[307.3,{"$f":"A87-$A$87","v":0},"R","CONTROL #6 - CAMPBELL RIVER\nMOHAWK GAS STATION",0,null,307.3,{"$f":"G87-$A$87","v":0},"R","CONTROL #6 - CAMPBELL RIVER\nMOHAWK GAS STATION",0]
[307.3,{"$f":"A88-$A$87","v":0},"SO","HWY 19A N",0.19999999999998863,null,307.3,{"$f":"G88-$A$87","v":0},"SO","HWY 19A N",0.19999999999998863]
[307.5,0.19999999999998863,"SO","at 1st lights - NOT to Port Hardy!!",0.19999999999998863,null,307.5,0.19999999999998863,"SO","at 1st lights - NOT to Port Hardy!!",0.19999999999998863]
[307.7,0.39999999999997726,"SO","HWY 28 @ Lights => Gold River",41.300000000000011,null,307.7,0.39999999999997726,"SO","HWY 28 @ Lights => Gold River",41.300000000000011]
[349,41.699999999999989,"SO","Strathcona Park Lodge on Right",6.5,null,349,41.699999999999989,"SO","Strathcona Park Lodge on Right",6.5]
[355.5,48.199999999999989,"R","Stay on HWY 28 - cross bridge ",39.899999999999977,null,355.5,48.199999999999989,"R","Stay on HWY 28 - cross bridge ",39.899999999999977]
[395.4,88.099999999999966,"L","MUCHALET DRIVE - Gold River",0.5,null,395.4,88.099999999999966,"L","MUCHALET DRIVE - Gold River",0.5]
[395.9,88.599999999999966,"R","NIMPKISH DRIVE",0.10000000000002274,null,395.9,88.599999999999966,"R","NIMPKISH DRIVE",0.10000000000002274]
[396,{"$f":"A95-$A$95","v":0},"L","CONTROL #7--GOLD RIVER\nGOLD RIVER CHALET PARKING\nANSWER QUEST. - CNTRL CARD",0,null,396,{"$f":"G95-$A$95","v":0},"L","CONTROL #7--GOLD RIVER\nGOLD RIVER CHALET PARKING\nANSWER QUEST. - CNTRL CARD",0]
[396,{"$f":"A96-$A$95","v":0},"U","RETURN TO CAMPELL RIVER",0.10000000000002274,null,396,{"$f":"G96-$A$95","v":0},"U","RETURN TO CAMPELL RIVER",0.10000000000002274]
[396.1,0.10000000000002274,"R","NIMPKISH DRIVE",9.9999999999965894E-2,null,396.1,0.10000000000002274,"R","NIMPKISH DRIVE",9.9999999999965894E-2]
[396.2,0.19999999999998863,"L","MUCHALET DRIVE @ Stop",0.5,null,396.2,0.19999999999998863,"L","MUCHALET DRIVE @ Stop",0.5]
[396.7,0.69999999999998863,"R","GOLD RIVER RD/HWY 28 @ Stop",39.600000000000023,null,396.7,0.69999999999998863,"R","GOLD RIVER RD/HWY 28 @ Stop",39.600000000000023]
[436.3,40.300000000000011,"L","HWY 28 @ Stop - after bridge",6.6999999999999886,null,436.3,40.300000000000011,"L","HWY 28 @ Stop - after bridge",6.6999999999999886]
[443,47,"SO","Strathcona Park Lodge on Left",41.100000000000023,null,443,47,"SO","Strathcona Park Lodge on Left",41.100000000000023]
[484.1,88.100000000000023,"SO","HWY #19A south to Downtown",0.19999999999998863,null,484.1,88.100000000000023,"SO","HWY #19A south to Downtown",0.19999999999998863]
[484.3,88.300000000000011,"SO","HWY #19A - 2nd set of lights",0.19999999999998863,null,484.3,88.300000000000011,"SO","HWY #19A - 2nd set of lights",0.19999999999998863]
[484.5,{"$f":"A104-$A$104","v":0},"L","CONTROL #8--CAMPBELL RIVER\nMOHAWK GAS STATION",0,null,484.5,{"$f":"G104-$A$104","v":0},"L","CONTROL #8--CAMPBELL RIVER\nMOHAWK GAS STATION",0]
[484.5,{"$f":"A105-$A$104","v":0},"L","Continue on HWY 19A S",2.6999999999999886,null,484.5,{"$f":"G105-$A$104","v":0},"L","Continue on HWY 19A S",2.6999999999999886]
[487.2,2.6999999999999886,"L","HWY 19A S @ Lights",33.900000000000034,null,487.2,2.6999999999999886,"L","HWY 19A S @ Lights",33.900000000000034]
[521.1,36.600000000000023,"L","COLEMAN RD",4.1999999999999318,null,521.1,36.600000000000023,"L","COLEMAN RD",4.1999999999999318]
[525.29999999999995,40.799999999999955,"R","BATES RD @ Stop => Airport",3.8000000000000682,null,525.29999999999995,40.799999999999955,"R","BATES RD @ Stop => Airport",3.8000000000000682]
[529.1,44.600000000000023,"R","WAVELAND RD. => Airport",3.7999999999999545,null,529.1,44.600000000000023,"R","WAVELAND RD. => Airport",3.7999999999999545]
[532.9,48.399999999999977,"L","ELLENOR RD @ Stop",1.3000000000000682,null,532.9,48.399999999999977,"L","ELLENOR RD @ Stop",1.3000000000000682]
[534.20000000000005,49.700000000000045,"R","WILKINSON",1.0999999999999091,null,534.20000000000005,49.700000000000045,"R","WILKINSON",1.0999999999999091]
[535.29999999999995,50.799999999999955,"R","LITTLE RIVER RD",0.5,null,535.29999999999995,50.799999999999955,"R","LITTLE RIVER RD",0.5]
[535.79999999999995,51.299999999999955,"R","Stay on LITTLE RIVER RD ",1.9000000000000909,null,535.79999999999995,51.299999999999955,"R","Stay on LITTLE RIVER RD ",1.9000000000000909]
[537.70000000000005,53.200000000000045,"SO","MILITARY ROW @ Stop",1.5999999999999091,null,537.70000000000005,53.200000000000045,"SO","MILITARY ROW @ Stop",1.5999999999999091]
[539.29999999999995,54.799999999999955,"SO","MILITARY ROW bc Pritchard Rd.",1.6000000000000227,null,539.29999999999995,54.799999999999955,"SO","MILITARY ROW bc Pritchard Rd.",1.6000000000000227]
[540.9,56.399999999999977,"SO","PRITCHARD RD @ Stop",1.8000000000000682,null,540.9,56.399999999999977,"SO","PRITCHARD RD @ Stop",1.8000000000000682]
[542.70000000000005,58.200000000000045,"VR","COMOX AVE",0.29999999999995453,null,542.70000000000005,58.200000000000045,"VR","COMOX AVE",0.29999999999995453]
[543,{"$f":"A118-$A$118","v":0},null,"CONTROL #9 - COMOX \nYOUR CHOICE or\nANSWER QUEST. - CNTRL CARD",5.2999999999999545,null,543,{"$f":"G118-$A$118","v":0},null,"CONTROL #9 - COMOX \nYOUR CHOICE or\nANSWER QUEST. - CNTRL CARD",5.2999999999999545]
[548.29999999999995,5.2999999999999545,"L","HWY 19A S @ Lights => Pksville",0.10000000000002274,null,548.29999999999995,5.2999999999999545,"L","HWY 19A S @ Lights => Pksville",0.10000000000002274]
[548.4,5.3999999999999773,"CO","CAUTION!! STEEL GRID BRIDGE",0.20000000000004547,null,548.4,5.3999999999999773,"CO","CAUTION!! STEEL GRID BRIDGE",0.20000000000004547]
[548.6,5.6000000000000227,"L","HWY 19A S @ Lights",1.5,null,548.6,5.6000000000000227,"L","HWY 19A S @ Lights",1.5]
[550.1,7.1000000000000227,"R","29th ST => Cumberland",5.5,null,550.1,7.1000000000000227,"R","29th ST => Cumberland",5.5]
[555.6,12.600000000000023,"SO","continue on to CUMBERLAND",1.6000000000000227,null,555.6,12.600000000000023,"SO","continue on to CUMBERLAND",1.6000000000000227]
[557.20000000000005,{"$f":"A124-$A$124","v":0},"R","CONTROL #10 - CUMBERLAND\nCumberland Rd + Bevan\nANSWER QUEST. - CNTRL CARD",0.29999999999995453,null,557.20000000000005,{"$f":"G124-$A$124","v":0},"R","CONTROL #10 - CUMBERLAND\nCumberland Rd + Bevan\nANSWER QUEST. - CNTRL CARD",0.29999999999995453]
[557.5,{"$f":"A125-$A$124","v":0.29999999999995453},"VL","FOURTH ST @ Peace Park",0.5,null,557.5,{"$f":"G125-$A$124","v":0.29999999999995453},"VL","FOURTH ST @ Peace Park",0.5]
[558,0.79999999999995453,"L ","DUNSMUIR AVE",6.7000000000000455,null,558,0.79999999999995453,"L ","DUNSMUIR AVE",6.7000000000000455]
[564.70000000000005,7.5,"R","HWY 19A S @ Lights=>Union Bay",55.399999999999977,null,564.70000000000005,7.5,"R","HWY 19A S @ Lights=>Union Bay",55.399999999999977]
[620.1,62.899999999999977,"R","MEMORIAL @ Shell Station",0.89999999999997726,null,620.1,62.899999999999977,"R","MEMORIAL @ Shell Station",0.89999999999997726]
[621,63.799999999999955,"SO","Courtyard Patio Café - Good pie!",2.7999999999999545,null,621,63.799999999999955,"SO","Courtyard Patio Café - Good pie!",2.7999999999999545]
[623.79999999999995,66.599999999999909,"SO","HWY 4W => Port Alberni",1,null,623.79999999999995,66.599999999999909,"SO","HWY 4W => Port Alberni",1]
[624.79999999999995,67.599999999999909,"R","HILLIERS RD S",4.8000000000000682,null,624.79999999999995,67.599999999999909,"R","HILLIERS RD S",4.8000000000000682]
[629.6,72.399999999999977,"R","HWY 4W @ T",29.199999999999932,null,629.6,72.399999999999977,"R","HWY 4W @ T",29.199999999999932]
[658.8,101.59999999999991,"VR","to stay on HWY 4W",4.1000000000000227,null,658.8,101.59999999999991,"VR","to stay on HWY 4W",4.1000000000000227]
[662.9,{"$f":"A134-$A$134","v":0},"L","CONTROL #11 - PORT ALBERNI\n7-11 CONVENIENCE STORE",{"$f":"A135-A134","v":0.10000000000002274},null,662.9,{"$f":"G134-$A$134","v":0},"L","CONTROL #11 - PORT ALBERNI\n7-11 CONVENIENCE STORE",{"$f":"G135-G134","v":0.10000000000002274}]
[663,{"$f":"A135-$A$134","v":0.10000000000002274},"U","Rt. Onto Johnston Rd/HWY 4E",0,null,663,{"$f":"G135-$A$134","v":0.10000000000002274},"U","Rt. Onto Johnston Rd/HWY 4E",0]
[663,{"$f":"A136-$A$134","v":0.10000000000002274},null,"Towards Parksville",34,null,663,{"$f":"G136-$A$134","v":0.10000000000002274},null,"Towards Parksville",34]
[697,34.100000000000023,"R","PRATT RD",2,null,697,34.100000000000023,"R","PRATT RD",2]
[699,36.100000000000023,"L","GRAFTON AVE",7.2999999999999545,null,699,36.100000000000023,"L","GRAFTON AVE",7.2999999999999545]
[706.3,43.399999999999977,"L","ERRINGTON RD",2,null,706.3,43.399999999999977,"L","ERRINGTON RD",2]
[708.3,45.399999999999977,"R","ALBERNI HWY",2.6000000000000227,null,708.3,45.399999999999977,"R","ALBERNI HWY",2.6000000000000227]
[710.9,48,"R","HWY 19 S =>Nanaimo",5.5,null,710.9,48,"R","HWY 19 S =>Nanaimo",5.5]
[716.4,53.5,"R","EXIT 46 TO HWY 19A N",0.60000000000002274,null,716.4,53.5,"R","EXIT 46 TO HWY 19A N",0.60000000000002274]
[717,54.100000000000023,"L","HWY 19A N @ Stop => Pksville",1,null,717,54.100000000000023,"L","HWY 19A N @ Stop => Pksville",1]
[718,55.100000000000023,"R","FRANKLIN'S GULL/NW BAY-lights",0.10000000000002274,null,718,55.100000000000023,"R","FRANKLIN'S GULL/NW BAY-lights",0.10000000000002274]
[718.1,55.200000000000045,"R","NORTH WEST BAY RD",9.6000000000000227,null,718.1,55.200000000000045,"R","NORTH WEST BAY RD",9.6000000000000227]
[727.7,64.800000000000068,"L","ISLAND HWY 19S =>Nanaimo",7.5999999999999091,null,727.7,64.800000000000068,"L","ISLAND HWY 19S =>Nanaimo",7.5999999999999091]
[735.3,72.399999999999977,"R","SUPERIOR RD",0.30000000000006821,null,735.3,72.399999999999977,"R","SUPERIOR RD",0.30000000000006821]
[735.6,72.700000000000045,"L","VANDENHOEK",0.10000000000002274,null,735.6,72.700000000000045,"L","VANDENHOEK",0.10000000000002274]
[735.7,72.800000000000068,"L","HARBY RD W",{"$f":"A150-A149","v":1.2999999999999545},null,735.7,72.800000000000068,"L","HARBY RD W",{"$f":"G150-G149","v":1.2999999999999545}]
[737,74.100000000000023,"SO","Becomes PHILIP RD",0.5,null,737,74.100000000000023,"SO","Becomes PHILIP RD",0.5]
[737.5,74.600000000000023,"L","AULDS RD",0.10000000000002274,null,737.5,74.600000000000023,"L","AULDS RD",0.10000000000002274]
[737.6,74.700000000000045,"R","To Stay on AULDS RD",2.6999999999999318,null,737.6,74.700000000000045,"R","To Stay on AULDS RD",2.6999999999999318]
[740.3,77.399999999999977,"SO","Cross NANAIMO PKWY/HWY 19",0.30000000000006821,null,740.3,77.399999999999977,"SO","Cross NANAIMO PKWY/HWY 19",0.30000000000006821]
[740.6,77.700000000000045,"R","METRAL DRIVE",1.2999999999999545,null,740.6,77.700000000000045,"R","METRAL DRIVE",1.2999999999999545]
[741.9,79,"R","DOUMONT RD",4.3000000000000682,null,741.9,79,"R","DOUMONT RD",4.3000000000000682]
[746.2,83.300000000000068,"L","BIGGS RD @ Stop ",3.5,null,746.2,83.300000000000068,"L","BIGGS RD @ Stop ",3.5]
[749.7,86.800000000000068,"R ","JINGLE POT RD",8.0999999999999091,null,749.7,86.800000000000068,"R ","JINGLE POT RD",8.0999999999999091]
[757.8,94.899999999999977,"SO","Cross NANAIMO PKWY/HWY 19",0.70000000000004547,null,757.8,94.899999999999977,"SO","Cross NANAIMO PKWY/HWY 19",0.70000000000004547]
[758.5,95.600000000000023,"VR","JINGLE POT RD becomes THIRD",1.1000000000000227,null,758.5,95.600000000000023,"VR","JINGLE POT RD becomes THIRD",1.1000000000000227]
[759.6,96.700000000000045,"R","WAKESIAH AVE",1.1999999999999318,null,759.6,96.700000000000045,"R","WAKESIAH AVE",1.1999999999999318]
[760.8,97.899999999999977,"L","SIXTH",0.90000000000009095,null,760.8,97.899999999999977,"L","SIXTH",0.90000000000009095]
[761.7,98.800000000000068,"R","BRUCE AVE",1.5999999999999091,null,761.7,98.800000000000068,"R","BRUCE AVE",1.5999999999999091]
[763.3,100.39999999999998,"VL","TENTH AVE",2.4000000000000909,null,763.3,100.39999999999998,"VL","TENTH AVE",2.4000000000000909]
[765.7,{"$f":"A164-$A$164","v":0},"R","CONTROL #12 - NANAIMO\nMOHAWK GAS STATION",0,null,765.7,{"$f":"G164-$A$164","v":0},"R","CONTROL #12 - NANAIMO\nMOHAWK GAS STATION",0]
[765.7,{"$f":"A165-$A$164","v":0},"R","Right out of Mohawk",9.9999999999909051E-2,null,765.7,{"$f":"G165-$A$164","v":0},"R","Right out of Mohawk",9.9999999999909051E-2]
[765.8,9.9999999999909051E-2,"R","TRANS CANADA HWY 1 @Lights",0.5,null,765.8,9.9999999999909051E-2,"R","TRANS CANADA HWY 1 @Lights",0.5]
[766.3,0.59999999999990905,"L","LEFT LANE FOR CEDAR RD",0.20000000000004547,null,766.3,0.59999999999990905,"L","LEFT LANE FOR CEDAR RD",0.20000000000004547]
[766.5,0.79999999999995453,"L","CEDAR RD @ Lights",3,null,766.5,0.79999999999995453,"L","CEDAR RD @ Lights",3]
[769.5,3.7999999999999545,"R","Stay on CEDAR RD -after bridge!",11.899999999999977,null,769.5,3.7999999999999545,"R","Stay on CEDAR RD -after bridge!",11.899999999999977]
[781.4,15.699999999999932,"L","HWY 1 @ lights - toward Victoria",30.899999999999977,null,781.4,15.699999999999932,"L","HWY 1 @ lights - toward Victoria",30.899999999999977]
[812.3,46.599999999999909,"R","DRINKWATER RD - Tim H. on rt.",1.5,null,812.3,46.599999999999909,"R","DRINKWATER RD - Tim H. on rt.",1.5]
[813.8,48.099999999999909,"L","SOMENOS RD",1.2000000000000455,null,813.8,48.099999999999909,"L","SOMENOS RD",1.2000000000000455]
[815,49.299999999999955,"R","COWICHAN LAKE RD @ Rndabt.",1.8999999999999773,null,815,49.299999999999955,"R","COWICHAN LAKE RD @ Rndabt.",1.8999999999999773]
[816.9,51.199999999999932,"L","COWICHAN LAKE RD ",16.399999999999977,null,816.9,51.199999999999932,"L","COWICHAN LAKE RD ",16.399999999999977]
[833.3,67.599999999999909,"SO","Cross SKUTZ FALLS RD @ Stop",5.9000000000000909,null,833.3,67.599999999999909,"SO","Cross SKUTZ FALLS RD @ Stop",5.9000000000000909]
[839.2,73.5,"L","GREENDALE RD",1.5999999999999091,null,839.2,73.5,"L","GREENDALE RD",1.5999999999999091]
[840.8,75.099999999999909,"L","COWICHAN LAKE RD @ T-Stop",0.20000000000004547,null,840.8,75.099999999999909,"L","COWICHAN LAKE RD @ T-Stop",0.20000000000004547]
[841,{"$f":"A178-$A$178","v":0},"R","CONTROL #13-LAKE COWICHAN\nESSO STATION @ MacDONALD",0,null,841,{"$f":"G178-$A$178","v":0},"R","CONTROL #13-LAKE COWICHAN\nESSO STATION @ MacDONALD",0]
[841,{"$f":"A179-$A$178","v":0},"U","LEFT ONTO COWICHAN LAKE RD",0.20000000000004547,null,841,{"$f":"G179-$A$178","v":0},"U","LEFT ONTO COWICHAN LAKE RD",0.20000000000004547]
[841.2,0.20000000000004547,"R","COWICHN LAKE RD-2nd right turn",7.3999999999999773,null,841.2,0.20000000000004547,"R","COWICHN LAKE RD-2nd right turn",7.3999999999999773]
[848.6,7.6000000000000227,"SO","Cross SKUTZ FALLS RD @ Stop",16.399999999999977,null,848.6,7.6000000000000227,"SO","Cross SKUTZ FALLS RD @ Stop",16.399999999999977]
[865,24,"R","TANSOR/COWICHAN LAKE RD",1.7999999999999545,null,865,24,"R","TANSOR/COWICHAN LAKE RD",1.7999999999999545]
[866.8,25.799999999999955,"L","SOMENOS RD @ Rndabout",1.3000000000000682,null,866.8,25.799999999999955,"L","SOMENOS RD @ Rndabout",1.3000000000000682]
[868.1,27.100000000000023,"R","DRINKWATER RD @ graveyard",{"$f":"A186-A184","v":1.6000000000000227},null,868.1,27.100000000000023,"R","DRINKWATER RD @ graveyard",{"$f":"G186-G184","v":1.6000000000000227}]
[null,null,"SO","cross Trans Canada Hwy 1 @ light",null,null,null,null,"SO","cross Trans Canada Hwy 1 @ light"]
[869.7,28.700000000000045,"L","BELL MCKINNON RD. Don't Miss!",1.5999999999999091,null,869.7,28.700000000000045,"L","BELL MCKINNON RD. Don't Miss!",1.5999999999999091]
[871.3,30.299999999999955,"SO","stay on BELL MCKINNON",3.7000000000000455,null,871.3,30.299999999999955,"SO","stay on BELL MCKINNON",3.7000000000000455]
[875,34,"R","WESTHOLME RD @ Stop",3,null,875,34,"R","WESTHOLME RD @ Stop",3]
[878,37,"SO","becomes CHEMAINUS RD",1.7000000000000455,null,878,37,"SO","becomes CHEMAINUS RD",1.7000000000000455]
[879.7,38.700000000000045,"R","CROFTON RD",3.6999999999999318,null,879.7,38.700000000000045,"R","CROFTON RD",3.6999999999999318]
[883.4,42.399999999999977,"R","YORK AVE/OSBORNE BAY RD",5.2000000000000455,null,883.4,42.399999999999977,"R","YORK AVE/OSBORNE BAY RD",5.2000000000000455]
[888.6,47.600000000000023,"L","HERD RD",2.7999999999999545,null,888.6,47.600000000000023,"L","HERD RD",2.7999999999999545]
[891.4,50.399999999999977,"R","MAPLE BAY RD =>Duncan",6,null,891.4,50.399999999999977,"R","MAPLE BAY RD =>Duncan",6]
[897.4,56.399999999999977,"L","TZOUHALEM -no sign- roundabout",0.20000000000004547,null,897.4,56.399999999999977,"L","TZOUHALEM -no sign- roundabout",0.20000000000004547]
[897.6,56.600000000000023,"SO","Cowichan Lodge on left",4.8999999999999773,null,897.6,56.600000000000023,"SO","Cowichan Lodge on left",4.8999999999999773]
[902.5,61.5,"SO","COWICHAN BAY RD @ Stop",5.7999999999999545,null,902.5,61.5,"SO","COWICHAN BAY RD @ Stop",5.7999999999999545]
[908.3,67.299999999999955,"L","TELEGRAPH RD -School on left",8.7000000000000455,null,908.3,67.299999999999955,"L","TELEGRAPH RD -School on left",8.7000000000000455]
[917,76,"R","KILMALU RD @ T-Stop",0.60000000000002274,null,917,76,"R","KILMALU RD @ T-Stop",0.60000000000002274]
[917.6,76.600000000000023,"L","TRANS CANADA HWY 1 @Lights",0.79999999999995453,null,917.6,76.600000000000023,"L","TRANS CANADA HWY 1 @Lights",0.79999999999995453]
[918.4,77.399999999999977,"R","SHAWNIGAN/MILL BAY RD -lights",5.3000000000000682,null,918.4,77.399999999999977,"R","SHAWNIGAN/MILL BAY RD -lights",5.3000000000000682]
[923.7,{"$f":"A201-$A$201","v":0},null,"CONTROL #14 - SHAWNIGAN\nYOUR CHOICE or\nANSWER QUEST. - CNTRL CARD",0,null,923.7,{"$f":"G201-$A$201","v":0},null,"CONTROL #14 - SHAWNIGAN\nYOUR CHOICE or\nANSWER QUEST. - CNTRL CARD",0]
[923.7,{"$f":"A202-$A$201","v":0},"L","SHAWNIGAN LAKE RD @ stop",2.2999999999999545,null,923.7,{"$f":"G202-$A$201","v":0},"L","SHAWNIGAN LAKE RD @ stop",2.2999999999999545]
[926,2.2999999999999545,"SO ","STOWOOD - up hill",0.70000000000004547,null,926,2.2999999999999545,"SO ","STOWOOD - up hill",0.70000000000004547]
[926.7,3,"SO","becomes SHAWNIGAN LAKE RD",4.6999999999999318,null,926.7,3,"SO","becomes SHAWNIGAN LAKE RD",4.6999999999999318]
[931.4,7.6999999999999318,"SO","CONTINUE STRAIGHT",0.20000000000004547,null,931.4,7.6999999999999318,"SO","CONTINUE STRAIGHT",0.20000000000004547]
[931.6,7.8999999999999773,"VL","UPHILL - SHAWNIGAN LAKE RD",5.6999999999999318,null,931.6,7.8999999999999773,"VL","UPHILL - SHAWNIGAN LAKE RD",5.6999999999999318]
[937.3,13.599999999999909,"R","TRANS CANADA HWY 1 @ Stop",13,null,937.3,13.599999999999909,"R","TRANS CANADA HWY 1 @ Stop",13]
[950.3,26.599999999999909,"R","GOLDSTREAM AVE",2.2000000000000455,null,950.3,26.599999999999909,"R","GOLDSTREAM AVE",2.2000000000000455]
[952.5,28.799999999999955,"L","SPENCER  Don't Miss!!",0.39999999999997726,null,952.5,28.799999999999955,"L","SPENCER  Don't Miss!!",0.39999999999997726]
[952.9,29.199999999999932,"SO","Cross Trans Canada Hwy 1 @ light",0.20000000000004547,null,952.9,29.199999999999932,"SO","Cross Trans Canada Hwy 1 @ light",0.20000000000004547]
[953.1,29.399999999999977,"R","BROCK AVE",0.10000000000002274,null,953.1,29.399999999999977,"R","BROCK AVE",0.10000000000002274]
[953.2,29.5,"L","FLORENCE LAKE RD",0.69999999999993179,null,953.2,29.5,"L","FLORENCE LAKE RD",0.69999999999993179]
[953.9,30.199999999999932,"R","SETCHFIELD RD @ Stop",{"$f":"A214-A213","v":1},null,953.9,30.199999999999932,"R","SETCHFIELD RD @ Stop",{"$f":"G214-G213","v":1}]
[954.9,31.199999999999932,"R","TREANOR RD",0.70000000000004547,null,954.9,31.199999999999932,"R","TREANOR RD",0.70000000000004547]
[955.6,{"$f":"A215-$A$215","v":0},"L","CONTROL #15- MILLSTREAM\nCO-OP GAS STATION\nSignature or Answer Question",0,null,955.6,{"$f":"G215-$A$215","v":0},"L","CONTROL #15- MILLSTREAM\nCO-OP GAS STATION\nSignature or Answer Question",0]
[955.6,{"$f":"A216-$A$215","v":0},"L","MILLSTREAM RD",4.5,null,955.6,{"$f":"G216-$A$215","v":0},"L","MILLSTREAM RD",4.5]
[960.1,4.5,"R","MILLSTREAM LAKE RD - uphill",1,null,960.1,4.5,"R","MILLSTREAM LAKE RD - uphill",1]
[961.1,5.5,"L","MILLSTREAM LAKE RD @ STOP",6.1999999999999318,null,961.1,5.5,"L","MILLSTREAM LAKE RD @ STOP",6.1999999999999318]
[967.3,11.699999999999932,"R","WILLIS PT. RD - no sign @ stop",4,null,967.3,11.699999999999932,"R","WILLIS PT. RD - no sign @ stop",4]
[971.3,15.699999999999932,"L","WALLACE DRIVE",3.2000000000000455,null,971.3,15.699999999999932,"L","WALLACE DRIVE",3.2000000000000455]
[974.5,18.899999999999977,"SO","WALLACE DRIVE",2.2000000000000455,null,974.5,18.899999999999977,"SO","WALLACE DRIVE",2.2000000000000455]
[976.7,21.100000000000023,"SO","Cross W. Saanich Rd @ light",3.5999999999999091,null,976.7,21.100000000000023,"SO","Cross W. Saanich Rd @ light",3.5999999999999091]
[980.3,24.699999999999932,"L","EAST SAANICH RD - @ Stop",4.6000000000000227,null,980.3,24.699999999999932,"L","EAST SAANICH RD - @ Stop",4.6000000000000227]
[984.9,29.299999999999955,"SO","EAST SAANICH RD -rndabout",0.39999999999997726,null,984.9,29.299999999999955,"SO","EAST SAANICH RD -rndabout",0.39999999999997726]
[985.3,29.699999999999932,"L","CANORA",0.70000000000004547,null,985.3,29.699999999999932,"L","CANORA",0.70000000000004547]
[986,30.399999999999977,"R","CANSO/OCEAN/STIRLING WAY",1.5,null,986,30.399999999999977,"R","CANSO/OCEAN/STIRLING WAY",1.5]
[987.5,31.899999999999977,"R","BEACON AVE @ Stop",0.10000000000002274,null,987.5,31.899999999999977,"R","BEACON AVE @ Stop",0.10000000000002274]
[987.6,32,"SO","Cross Hwy 17 @ light",0.39999999999997726,null,987.6,32,"SO","Cross Hwy 17 @ light",0.39999999999997726]
[988,{"$f":"A229-$A$229","v":0},"L","CONTROL #16- SIDNEY\n7-11 CONVENIENCE STORE",0,null,988,{"$f":"G229-$A$229","v":0},"L","CONTROL #16- SIDNEY\n7-11 CONVENIENCE STORE",0]
[988,{"$f":"A230-$A$229","v":0},"L","BEACON AVE - east",0.10000000000002274,null,988,{"$f":"G230-$A$229","v":0},"L","BEACON AVE - east",0.10000000000002274]
[988.1,0.10000000000002274,"R","FIFTH ST",0.69999999999993179,null,988.1,0.10000000000002274,"R","FIFTH ST",0.69999999999993179]
[988.8,0.79999999999995453,"SO","FIFTH ST becomes LOCHSIDE",6,null,988.8,0.79999999999995453,"SO","FIFTH ST becomes LOCHSIDE",6]
[994.8,6.7999999999999545,"R","MT.NEWTON X RD @ Stop",0.20000000000004547,null,994.8,6.7999999999999545,"R","MT.NEWTON X RD @ Stop",0.20000000000004547]
[995,7,"L","ROUTE 17 @ Light",9,null,995,7,"L","ROUTE 17 @ Light",9]
[1004,16,"R","ELK LAKE RD @ Lights",2,null,1004,16,"R","ELK LAKE RD @ Lights",2]
[1006,18,"SO","Cross Royal Oak Ave @ Light",0.29999999999995453,null,1006,18,"SO","Cross Royal Oak Ave @ Light",0.29999999999995453]
[1006.3,18.299999999999955,"L","WEST SAANICH RD @ Light",0.70000000000004547,null,1006.3,18.299999999999955,"L","WEST SAANICH RD @ Light",0.70000000000004547]
[1007,19,"R","Shopping Plaza (Co-Op Gas)",0.20000000000004547,null,1007,19,"R","Shopping Plaza (Co-Op Gas)",0.20000000000004547]
[1007.2,null,"L","CONTROL #17 - FINISH\nTIM HORTON’S or McDonald's\n110-4440 West Saanich Rd.,\nROYAL OAK PLAZA,\nSAANICH",null,null,1007.2,null,"L","CONTROL #17 - FINISH\nTIM HORTON’S or McDonald's\n110-4440 West Saanich Rd.,\nROYAL OAK PLAZA,\nSAANICH"]
[null,null,null,"CONGRATULATIONS!!\n\nROUTE BACK TO THE START",0,null,null,null,null,"CONGRATULATIONS!!\n\nROUTE BACK TO THE START",0]
[0,null,"L","onto no name alley",0.1,null,0,null,"L","onto no name alley",0.1]
[0.1,null,"R","WEST SAANICH RD ",0.4,null,0.1,null,"R","WEST SAANICH RD ",0.4]
[0.5,null,"R","Glanford Ave",2.2999999999999998,null,0.5,null,"R","Glanford Ave",2.2999999999999998]
[2.8,null,"SO","Cross McKenzie Ave",0.30000000000000027,null,2.8,null,"SO","Cross McKenzie Ave",0.30000000000000027]
[3.1,null,"L","Carey Rd",0.19999999999999973,null,3.1,null,"L","Carey Rd",0.19999999999999973]
[3.3,null,"SO","Cross Tillicum",1,null,3.3,null,"SO","Cross Tillicum",1]
[4.3,null,"L","RAVINE WAY (At sign)",0.10000000000000053,null,4.3,null,"L","RAVINE WAY (At sign)",0.10000000000000053]
[4.4000000000000004,null,"SO","Cross Blanshard @ light",9.9999999999999645E-2,null,4.4000000000000004,null,"SO","Cross Blanshard @ light",9.9999999999999645E-2]
[4.5,null,"R","Saanich Plaza & Tim Horton's ",null,null,4.5,null,"R","Saanich Plaza & Tim Horton's "]

{"sheet":"Web results","index":5,"n_rows":11,"n_cols":5,"rows_kept":11,"cut":false,"hidden":false,"merged":[]}
[{"$f":"Brevet_Number","v":"VI1000B"}]
["RIDER",null,null,"TIME"]
[{"$f":"#REF!","v":{"$error":"#REF!"}},{"$f":"#REF!","v":{"$error":"#REF!"}},null,{"$f":"#REF!","v":{"$error":"#REF!"}},{"$f":"#REF!","v":{"$error":"#REF!"}}]
[]
[]
[]
["Time is in hours and minutes."]
["l   includes 1/2 hour penalty - no lights"]
["f   includes 1/2 hour penalty - no fenders"]
["e  rode 1 week early"]
["d  rode 1 week late"]

{"sheet":"Sheet1","index":6,"n_rows":0,"n_cols":0,"rows_kept":0,"cut":false,"hidden":false,"merged":[]}